{"text_format":"3","workbook":"xlsx","n_sheets":15,"sheets":["Tabulky","Zápisy","RozpisS","Rozpis","Tabulka","Statistiky","BCI","LOW","BOB","DEM","T5","T6","T7","T8","CELKEM"],"not_rendered":{"macros":1,"defined_names":2},"read":"whole","date_system":"1900"}

{"sheet":"Tabulky","index":0,"n_rows":13,"n_cols":8,"rows_kept":13}
[null,"BCI","LOW","BOB","DEM"," skóre","body","pořadí"]
["A1 BCI","X","2:17","1:19","12:1","15:37","2","3"]
["A2 LOW","17:2","X","11:12","22:0","50:14","4","2"]
["A3 BOB","19:1","12:11","X","25:1","56:13","6","1"]
["A4 DEM","1:12","0:22","1:25","X","2:59","0","4"]
[]
["zápasy:"]
["09:30:00","A1:A2","BCI","2:17","LOW"]
["10:30:00","A3:A4","BOB","25:1","DEM"]
["11:30:00","A1:A3","BCI","1:19","BOB"]
["12:30:00","A2:A4","LOW","22:0","DEM"]
["13:30:00","A1:A4","BCI","12:1","DEM"]
["14:30:00","A2:A3","LOW","11:12","BOB"]

{"sheet":"Zápisy","index":1,"n_rows":33,"n_cols":22,"rows_kept":33,"merged":[[0,0,0,1],[0,2,1,4],[0,5,1,5],[0,6,0,7],[0,8,1,10],[0,13,1,15],[1,0,1,1],[1,6,1,7],[2,13,3,14],[8,13,9,14],[14,13,14,15],[25,1,26,2],[25,3,26,4],[25,7,26,8],[25,9,26,10],[28,1,29,2],[28,3,29,4],[28,7,29,8],[28,9,29,10],[28,13,29,15],[31,1,32,2],[31,3,32,4],[31,7,32,8],[31,9,32,10],[31,13,32,15]]}
["Domácí",null,{"$f":"INDEX(R4:R11,T3,1)","v":"Bobři"},null,null,":","Hosté",null,{"$f":"INDEX(R4:R11,U3,1)","v":"Démoni"},{"$nulls":4},"ÚSPĚŠNÉ zásahy brankařů"]
["BOB",{"$nulls":5},"DEM"]
["#","i","jméno","góly","náhry","stav","#","i","jméno","góly","náhry","stav",null,{"$f":"A2","v":"BOB"},{"$nulls":3},"týmy","kódy",{"$f":"SUM(T4:T11)","v":3},{"$f":"SUM(U4:U11)","v":4},"radek"]
[{"$f":"IF(\"\"<>INDIRECT(ADDRESS(3+$V4,3,,,$A$2)),INDIRECT(ADDRESS(3+$V4,3,,,$A$2)),\"\")","v":10},{"$f":"IF(\"\"<>INDIRECT(ADDRESS(3+$V4,1,,,$A$2)),INDIRECT(ADDRESS(3+$V4,1,,,$A$2)),\"\")","v":""},{"$f":"IF(\"\"<>INDIRECT(ADDRESS(3+$V4,2,,,$A$2)),INDIRECT(ADDRESS(3+$V4,2,,,$A$2)),\"\")","v":"Eliáš Mesany"},null,null,":",{"$f":"IF(\"\"<>INDIRECT(ADDRESS(3+$V4,3,,,$G$2)),INDIRECT(ADDRESS(3+$V4,3,,,$G$2)),\"\")","v":6},{"$f":"IF(\"\"<>INDIRECT(ADDRESS(3+$V4,1,,,$G$2)),INDIRECT(ADDRESS(3+$V4,1,,,$G$2)),\"\")","v":"B"},{"$f":"IF(\"\"<>INDIRECT(ADDRESS(3+$V4,2,,,$G$2)),INDIRECT(ADDRESS(3+$V4,2,,,$G$2)),\"\")","v":"Hofmanová Lenka"},null,null,":",{"$nulls":5},{"$f":"BCI!B1","v":"Bobříci"},{"$f":"BCI!B2","v":"BCI"},{"$f":"IF($A$2=S4,1,\"\")","v":""},{"$f":"IF($G$2=S4,1,\"\")","v":""},1]
[6,"b","Vojtěch Procházka",null,null,":",30,"","Fulín David *",null,null,":",{"$nulls":5},{"$f":"LOW!B1","v":"Lowlander Zábřeh"},{"$f":"LOW!B2","v":"LOW"},{"$f":"IF($A$2=S5,2,\"\")","v":""},{"$f":"IF($G$2=S5,2,\"\")","v":""},2]
[7,"","Matyáš Dolenský",null,null,":",7,"","Krejčovská Michaela *",null,null,":",{"$nulls":5},{"$f":"BOB!B1","v":"Bobři"},{"$f":"BOB!B2","v":"BOB"},{"$f":"IF($A$2=S6,3,\"\")","v":3},{"$f":"IF($G$2=S6,3,\"\")","v":""},3]
[3,"","Kryštof Abel",null,null,":",31,"","Adámek Albert *",null,null,":",{"$nulls":5},{"$f":"DEM!B1","v":"Démoni"},{"$f":"DEM!B2","v":"DEM"},{"$f":"IF($A$2=S7,4,\"\")","v":""},{"$f":"IF($G$2=S7,4,\"\")","v":4},4]
[4,"","Emil Hejda",null,null,":",10,"","Sejková Berenika *",null,null,":",{"$nulls":7},{"$f":"IF($A$2=S8,5,\"\")","v":""},{"$f":"IF($G$2=S8,5,\"\")","v":""},5]
[2,"","Jonáš Vodňanský",null,null,":",41,"","Sejková Viola *",null,null,":",null,{"$f":"G2","v":"DEM"},{"$nulls":5},{"$f":"IF($A$2=S9,6,\"\")","v":""},{"$f":"IF($G$2=S9,6,\"\")","v":""},6]
["","","",null,null,":",4,"","Sejk Jáchym",null,null,":",{"$nulls":7},{"$f":"IF($A$2=S10,7,\"\")","v":""},{"$f":"IF($G$2=S10,7,\"\")","v":""},7]
["","","",null,null,":",99,"","Vaněčková Dorota *",null,null,":",{"$nulls":7},{"$f":"IF($A$2=S11,8,\"\")","v":""},{"$f":"IF($G$2=S11,8,\"\")","v":""},8]
["","","",null,null,":",8,"","Jirovský Matyáš *",null,null,":",{"$nulls":9},9]
["","","",null,null,":","","","",null,null,":",{"$nulls":9},10]
["","","",null,null,":","","","",null,null,":",{"$nulls":9},11]
["","","",null,null,":","","","",null,null,":",null,"TRESTY",{"$nulls":7},12]
["","","",null,null,":","","","",null,null,":",null,"tým","#","min",{"$nulls":5},13]
["","","",null,null,":","","","",null,null,":",{"$nulls":9},14]
["","","",null,null,":","","","",null,null,":",{"$nulls":9},15]
["","","",null,null,":","","","",null,null,":",{"$nulls":9},16]
["","","",null,null,":","","","",null,null,":",{"$nulls":9},17]
["","","",null,null,":","","","",null,null,":",{"$nulls":9},18]
["","","",null,null,":","","","",null,null,":",{"$nulls":9},19]
["","","",null,null,":","","","",null,null,":",{"$nulls":9},20]
["","","",null,null,":","","","",null,null,":",{"$nulls":9},21]
["","Kapitán",{"$nulls":3},":","","Kapitán",{"$nulls":3},":",{"$nulls":9},32]
["","jméno",null,"podpis",null,":","","jméno",null,"podpis",null,":",{"$nulls":9},33]
["",{"$nulls":4},":","",{"$nulls":4},":",{"$nulls":9},34]
["","Rozhodčí hlavní",{"$nulls":3},":","","Zapisovatel 1",{"$nulls":3},":",null,"akce",{"$nulls":7},35]
["","jméno",null,"podpis",null,":","","jméno",null,"podpis",null,":",null,"O Put.Lak.",{"$nulls":7},36]
["",{"$nulls":4},":","",{"$nulls":4},":",{"$nulls":9},37]
["","Rozhodčí vedlejší",{"$nulls":3},":","","Zapisovatel 2",{"$nulls":3},":",null,"datum",{"$nulls":7},38]
["","jméno",null,"podpis",null,":","","jméno",null,"podpis",null,":",null,"2024-04-06",{"$nulls":7},39]
["",{"$nulls":4},":","",{"$nulls":4},":",{"$nulls":9},40]

{"sheet":"RozpisS","index":2,"n_rows":43,"n_cols":21,"rows_kept":43,"hidden":true,"merged":[[0,0,0,1],[0,2,1,4],[0,5,1,5],[0,6,0,7],[0,8,1,10],[0,12,2,14],[1,0,1,1],[1,6,1,7],[3,12,4,14],[9,12,10,14],[16,12,17,14],[35,1,36,2],[35,3,36,4],[35,7,36,8],[35,9,36,10],[35,12,36,14],[38,1,39,2],[38,3,39,4],[38,7,39,8],[38,9,39,10],[38,12,39,14],[41,1,42,2],[41,3,42,4],[41,7,42,8],[41,9,42,10]]}
["Domácí",null,{"$f":"INDEX(Q4:Q11,S3,1)","v":{"$error":"#VALUE!"}},null,null,":","Hosté",null,{"$f":"INDEX(Q4:Q11,T3,1)","v":{"$error":"#VALUE!"}},{"$nulls":3},"ÚSPĚŠNÉ ZÁSAHY BRANKAŘU"]
["HIG",{"$nulls":5},"FAB"]
["#","i","jméno","góly","náhry","stav","#","i","jméno","góly","náhry",{"$nulls":5},"týmy","kódy",{"$f":"SUM(S4:S11)","v":0},{"$f":"SUM(T4:T11)","v":0},"radek"]
[{"$f":"IF(\"\"<>INDIRECT(ADDRESS(3+$U4,3,,,$A$2)),INDIRECT(ADDRESS(3+$U4,3,,,$A$2)),\"\")","v":{"$error":"#REF!"}},{"$f":"IF(\"\"<>INDIRECT(ADDRESS(3+$U4,1,,,$A$2)),INDIRECT(ADDRESS(3+$U4,1,,,$A$2)),\"\")","v":{"$error":"#REF!"}},{"$f":"IF(\"\"<>INDIRECT(ADDRESS(3+$U4,2,,,$A$2)),INDIRECT(ADDRESS(3+$U4,2,,,$A$2)),\"\")","v":{"$error":"#REF!"}},null,null,":",{"$f":"IF(\"\"<>INDIRECT(ADDRESS(3+$U4,3,,,$G$2)),INDIRECT(ADDRESS(3+$U4,3,,,$G$2)),\"\")","v":{"$error":"#REF!"}},{"$f":"IF(\"\"<>INDIRECT(ADDRESS(3+$U4,1,,,$G$2)),INDIRECT(ADDRESS(3+$U4,1,,,$G$2)),\"\")","v":{"$error":"#REF!"}},{"$f":"IF(\"\"<>INDIRECT(ADDRESS(3+$U4,2,,,$G$2)),INDIRECT(ADDRESS(3+$U4,2,,,$G$2)),\"\")","v":{"$error":"#REF!"}},{"$nulls":3},{"$f":"A2","v":"HIG"},{"$nulls":3},{"$f":"BOB!B1","v":"Bobři"},{"$f":"BOB!B2","v":"BOB"},{"$f":"IF($A$2=R4,1,\"\")","v":""},{"$f":"IF($G$2=R4,1,\"\")","v":""},1]
[{"$f":"IF(\"\"<>INDIRECT(ADDRESS(3+$U5,3,,,$A$2)),INDIRECT(ADDRESS(3+$U5,3,,,$A$2)),\"\")","v":{"$error":"#REF!"}},{"$f":"IF(\"\"<>INDIRECT(ADDRESS(3+$U5,1,,,$A$2)),INDIRECT(ADDRESS(3+$U5,1,,,$A$2)),\"\")","v":{"$error":"#REF!"}},{"$f":"IF(\"\"<>INDIRECT(ADDRESS(3+$U5,2,,,$A$2)),INDIRECT(ADDRESS(3+$U5,2,,,$A$2)),\"\")","v":{"$error":"#REF!"}},null,null,":",{"$f":"IF(\"\"<>INDIRECT(ADDRESS(3+$U5,3,,,$G$2)),INDIRECT(ADDRESS(3+$U5,3,,,$G$2)),\"\")","v":{"$error":"#REF!"}},{"$f":"IF(\"\"<>INDIRECT(ADDRESS(3+$U5,1,,,$G$2)),INDIRECT(ADDRESS(3+$U5,1,,,$G$2)),\"\")","v":{"$error":"#REF!"}},{"$f":"IF(\"\"<>INDIRECT(ADDRESS(3+$U5,2,,,$G$2)),INDIRECT(ADDRESS(3+$U5,2,,,$G$2)),\"\")","v":{"$error":"#REF!"}},{"$nulls":7},{"$f":"LOW!B1","v":"Lowlander Zábřeh"},{"$f":"LOW!B2","v":"LOW"},{"$f":"IF($A$2=R5,2,\"\")","v":""},{"$f":"IF($G$2=R5,2,\"\")","v":""},2]
[{"$error":"#REF!"},{"$error":"#REF!"},{"$error":"#REF!"},null,null,":",{"$error":"#REF!"},{"$error":"#REF!"},{"$error":"#REF!"},{"$nulls":7},{"$f":"BCI!B1","v":"Bobříci"},{"$f":"BCI!B2","v":"BCI"},{"$f":"IF($A$2=R6,3,\"\")","v":""},{"$f":"IF($G$2=R6,3,\"\")","v":""},3]
[{"$error":"#REF!"},{"$error":"#REF!"},{"$error":"#REF!"},null,null,":",{"$error":"#REF!"},{"$error":"#REF!"},{"$error":"#REF!"},{"$nulls":7},{"$f":"'T5'!B1","v":"T5"},{"$f":"'T5'!B2","v":"T5"},{"$f":"IF($A$2=R7,4,\"\")","v":""},{"$f":"IF($G$2=R7,4,\"\")","v":""},4]
[{"$error":"#REF!"},{"$error":"#REF!"},{"$error":"#REF!"},null,null,":",{"$error":"#REF!"},{"$error":"#REF!"},{"$error":"#REF!"},{"$nulls":7},{"$f":"DEM!B1","v":"Démoni"},{"$f":"DEM!B2","v":"DEM"},{"$f":"IF($A$2=R8,5,\"\")","v":""},{"$f":"IF($G$2=R8,5,\"\")","v":""},5]
[{"$error":"#REF!"},{"$error":"#REF!"},{"$error":"#REF!"},null,null,":",{"$error":"#REF!"},{"$error":"#REF!"},{"$error":"#REF!"},{"$nulls":9},{"$f":"IF($A$2=R9,6,\"\")","v":""},{"$f":"IF($G$2=R9,6,\"\")","v":""},6]
[{"$error":"#REF!"},{"$error":"#REF!"},{"$error":"#REF!"},null,null,":",{"$error":"#REF!"},{"$error":"#REF!"},{"$error":"#REF!"},{"$nulls":3},{"$f":"G2","v":"FAB"},{"$nulls":5},{"$f":"IF($A$2=R10,7,\"\")","v":""},{"$f":"IF($G$2=R10,7,\"\")","v":""},7]
[{"$error":"#REF!"},{"$error":"#REF!"},{"$error":"#REF!"},null,null,":",{"$error":"#REF!"},{"$error":"#REF!"},{"$error":"#REF!"},{"$nulls":9},{"$f":"IF($A$2=R11,8,\"\")","v":""},{"$f":"IF($G$2=R11,8,\"\")","v":""},8]
[{"$error":"#REF!"},{"$error":"#REF!"},{"$error":"#REF!"},null,null,":",{"$error":"#REF!"},{"$error":"#REF!"},{"$error":"#REF!"},{"$nulls":11},9]
[{"$error":"#REF!"},{"$error":"#REF!"},{"$error":"#REF!"},null,null,":",{"$error":"#REF!"},{"$error":"#REF!"},{"$error":"#REF!"},{"$nulls":11},10]
[{"$error":"#REF!"},{"$error":"#REF!"},{"$error":"#REF!"},null,null,":",{"$error":"#REF!"},{"$error":"#REF!"},{"$error":"#REF!"},{"$nulls":11},11]
[{"$error":"#REF!"},{"$error":"#REF!"},{"$error":"#REF!"},null,null,":",{"$error":"#REF!"},{"$error":"#REF!"},{"$error":"#REF!"},{"$nulls":11},12]
[{"$error":"#REF!"},{"$error":"#REF!"},{"$error":"#REF!"},null,null,":",{"$error":"#REF!"},{"$error":"#REF!"},{"$error":"#REF!"},{"$nulls":11},13]
[{"$error":"#REF!"},{"$error":"#REF!"},{"$error":"#REF!"},null,null,":",{"$error":"#REF!"},{"$error":"#REF!"},{"$error":"#REF!"},{"$nulls":3},"TRESTY",{"$nulls":7},14]
[{"$error":"#REF!"},{"$error":"#REF!"},{"$error":"#REF!"},null,null,":",{"$error":"#REF!"},{"$error":"#REF!"},{"$error":"#REF!"},{"$nulls":11},15]
[{"$error":"#REF!"},{"$error":"#REF!"},{"$error":"#REF!"},null,null,":",{"$error":"#REF!"},{"$error":"#REF!"},{"$error":"#REF!"},{"$nulls":3},"tým","#","min",{"$nulls":5},16]
[{"$error":"#REF!"},{"$error":"#REF!"},{"$error":"#REF!"},null,null,":",{"$error":"#REF!"},{"$error":"#REF!"},{"$error":"#REF!"},{"$nulls":11},17]
[{"$error":"#REF!"},{"$error":"#REF!"},{"$error":"#REF!"},null,null,":",{"$error":"#REF!"},{"$error":"#REF!"},{"$error":"#REF!"},{"$nulls":11},18]
[{"$error":"#REF!"},{"$error":"#REF!"},{"$error":"#REF!"},null,null,":",{"$error":"#REF!"},{"$error":"#REF!"},{"$error":"#REF!"},{"$nulls":11},19]
[{"$error":"#REF!"},{"$error":"#REF!"},{"$error":"#REF!"},null,null,":",{"$error":"#REF!"},{"$error":"#REF!"},{"$error":"#REF!"},{"$nulls":11},20]
[{"$error":"#REF!"},{"$error":"#REF!"},{"$error":"#REF!"},null,null,":",{"$error":"#REF!"},{"$error":"#REF!"},{"$error":"#REF!"},{"$nulls":11},21]
[{"$error":"#REF!"},{"$error":"#REF!"},{"$error":"#REF!"},null,null,":",{"$error":"#REF!"},{"$error":"#REF!"},{"$error":"#REF!"},{"$nulls":11},22]
[{"$error":"#REF!"},{"$error":"#REF!"},{"$error":"#REF!"},null,null,":",{"$error":"#REF!"},{"$error":"#REF!"},{"$error":"#REF!"},{"$nulls":11},23]
[{"$error":"#REF!"},{"$error":"#REF!"},{"$error":"#REF!"},null,null,":",{"$error":"#REF!"},{"$error":"#REF!"},{"$error":"#REF!"},{"$nulls":11},24]
[{"$error":"#REF!"},{"$error":"#REF!"},{"$error":"#REF!"},null,null,":",{"$error":"#REF!"},{"$error":"#REF!"},{"$error":"#REF!"},{"$nulls":11},25]
[{"$error":"#REF!"},{"$error":"#REF!"},{"$error":"#REF!"},null,null,":",{"$error":"#REF!"},{"$error":"#REF!"},{"$error":"#REF!"},{"$nulls":11},26]
[{"$error":"#REF!"},{"$error":"#REF!"},{"$error":"#REF!"},null,null,":",{"$error":"#REF!"},{"$error":"#REF!"},{"$error":"#REF!"},{"$nulls":11},27]
[{"$error":"#REF!"},{"$error":"#REF!"},{"$error":"#REF!"},null,null,":",{"$error":"#REF!"},{"$error":"#REF!"},{"$error":"#REF!"},{"$nulls":11},28]
[{"$error":"#REF!"},{"$error":"#REF!"},{"$error":"#REF!"},null,null,":",{"$error":"#REF!"},{"$error":"#REF!"},{"$error":"#REF!"},{"$nulls":11},29]
[{"$error":"#REF!"},{"$error":"#REF!"},{"$error":"#REF!"},null,null,":",{"$error":"#REF!"},{"$error":"#REF!"},{"$error":"#REF!"},{"$nulls":11},30]
[{"$error":"#REF!"},{"$error":"#REF!"},{"$error":"#REF!"},null,null,":",{"$error":"#REF!"},{"$error":"#REF!"},{"$error":"#REF!"},{"$nulls":11},31]
[{"$error":"#REF!"},null,"Kapitán",null,null,":",{"$error":"#REF!"},null,"Kapitán",{"$nulls":3},"místo",{"$nulls":7},32]
[{"$error":"#REF!"},"jméno",null,"podpis",null,":",{"$error":"#REF!"},"jméno",null,"podpis",null,null,"MČR muži",{"$nulls":7},33]
[{"$error":"#REF!"},{"$nulls":4},":",{"$error":"#REF!"},{"$nulls":13},34]
[{"$error":"#REF!"},null,"Rozhodčí hlavní",null,null,":",{"$error":"#REF!"},null,"Zapisovatel 1",{"$nulls":3},"datum",{"$nulls":7},35]
[{"$error":"#REF!"},"jméno",null,"podpis",null,":",{"$error":"#REF!"},"jméno",null,"podpis",null,null,"2022-06-18",{"$nulls":7},36]
[{"$error":"#REF!"},{"$nulls":4},":",{"$error":"#REF!"},{"$nulls":13},37]
[{"$error":"#REF!"},null,"Rozhodčí vedlejší",null,null,":",{"$error":"#REF!"},null,"Zapisovatel 2",{"$nulls":11},38]
[{"$error":"#REF!"},"jméno",null,"podpis",null,":",{"$error":"#REF!"},"jméno",null,"podpis",{"$nulls":10},39]
[{"$error":"#REF!"},{"$nulls":4},":",{"$error":"#REF!"},{"$nulls":13},40]

{"sheet":"Rozpis","index":3,"n_rows":32,"n_cols":18,"rows_kept":32,"hidden":true,"merged":[[15,9,37,11],[30,0,30,7]]}
["sobota 18.6.",{"$nulls":8},"muži","Iktočante","IKT",1,"2*25","Matěj Melichar","matej.melichar@seznam.cz"]
["ČAS","Hřiště",{"$nulls":4},"Hosté","píská",null,null,"Refugees","RFG",4,null,"Matzáš Jurkovič","Matyasjurkovic@gmail.com"]
["10:00:00","A","Refugees",null,":",null,"Bobři","HIG","4-3",null,"Bobři","BOB",3,null,"Staněk Ondřej","ondra02.stanek@seznam.cz","Guma","j.veit@volny.cz"]
[null,"B","Fabiánky Strašice",null,":",null,"Trilobit beta","PAK","4-1",null,"Highlander Zábřeh","HIG",5]
["11:00:00","A","Tyšunky",null,":",null,"Paka","FBZ","3-2",null,"Fabiáni Strašice","FAB",2,null,"Pavel Bůcha","bucha.p@seznam.cz","Pavel Bůcha"]
[null,"B","Bobříci",null,":",null,"Lowlander Zábřeh","RFG","4-1","ženy","Fabiánky Strašice","FBZ",1,"2*20","Věra","vera.silhanova@post.cz"]
["12:00:00","A","Highlander Zábřeh",null,":",null,"Fabiáni Strašice","IKT","5-2",null,"Trilobit beta","TRI",4,null,"Barbora Vykouková","vykouk.ba@gmail.com"]
[null,"B","Wallowa",null,":",null,"Stopaři","BOB","3-2",null,"Tyšunky","TYS",2,null,"Olina Hilgartová Zýková","zykova.o@gmail.com","Drnková Veronika","drnkova@gmail.com"]
["13:00:00","A","Iktočante",null,":",null,"Bobři","FAB","1-3",null,"Paka","PAK",3,null,"Pavla Gründlerová","Pavla.Grundler@seznam.cz"]
[null,"B","Trilobit beta",null,":",null,"Tyšunky","PAK","4-2","do 15ti","Bobříci","BCI",1,"2*20","Guma","j.veit@volny.cz"]
["14:00:00","A","Lowlander Zábřeh",null,":",null,"Stopaři","BOB","4-2",null,"Lowlander Zábřeh","LOW",4]
[null,"B","Paka",null,":",null,"Fabiánky Strašice","TYS","1-3",null,"Wallowa","WAL",3,null,"Alexandra Šuláková","alexandra.sulakova@gmail.com"]
["15:00:00","A","Fabiáni Strašice",null,":",null,"Refugees","IKT","1-3",null,"Stopaři","STO",2,null,"Martin Vágner","mrtnvagner@gmail.com"]
[null,"B","Bobříci",null,":",null,"Wallowa","TRI","2-4",{"$nulls":3},"5 týmů","4 týmy"]
["16:00:00","A","Iktočante",null,":",null,"Highlander Zábřeh","RFG","1-5",{"$nulls":3},"5-2","4-1"]
[null,"B","Paka",null,":",null,"Trilobit beta","FBZ","3-4","Systém turnajů:\nVšechny zápasy se hrají do vítězství jednoho z týmů. V případě remízy v základní hrací době dochází k výměně stran a ihned se zahajuje prodloužení, které končí prvním vstřeleným gólem. Pokud se hraje ve skupině, za výhru jsou 3 body, za výhru v prodloužení 2 body a prohru v prodloužení jeden bod.\nPořadí ve skupinách se určuje podle následujícího pořadí: počet bodů ve skupině, minitabulka týmů se stejným počtem bodů (body, rozdíl skóre, počet vstřelených gólů), rozdíl skóre, počet vstřelených gólů, dovednostní disciplína.\nTurnaj mužů: hraje se skupina každý s každým, zápasy 2*25 minut.\nTurnaj žen: hraje se skupina každý s každým, následně první a druhý tým hraje finále a třetí a čtvrtý o třetí místo, zápasy 2*20 minut, finále 2*25 minut.\nTurnaj do 15ti let: hraje se skupina každý s každým, následně první a druhý tým hraje finále a třetí a čtvrtý o třetí místo, zápasy 2*20 minut.\n",null,null,"4-3","3-2","wal","BOBŘÍCI (žáci):"]
["17:00:00","A","Wallowa",null,":",null,"Lowlander Zábřeh","FAB","3-4",{"$nulls":3},"1-5","4-2","Hana Dzuriková - B","Kryštof Abel 12,"]
[null,"B","Tyšunky",null,":",null,"Fabiánky Strašice","TRI","2-1",{"$nulls":3},"2-4","1-3","Jarmila Hažmuková - 2","Matouš Cícha 7,"]
["18:00:00","A","Stopaři",null,":",null,"Bobříci","HIG","2-1",{"$nulls":3},"1-3","3-4","Tereza Horáková - 13","Matyáš Dolenský 17,"]
["neděle 19.6.",{"$nulls":12},"2-1","Tereza Řeháková - 25","Emil Hejda 4,"]
["ČAS","Hřiště",{"$nulls":4},"Hosté","píská",{"$nulls":4},"5-4",null,"Adéla Mikaušová - 38","Benjamín Mesany 11,"]
["09:00:00","A","muži skupina*",null,":",{"$nulls":7},"2-1",null,"Lukáš Lank - 99","Eliáš Mesany 15,"]
["10:10:00","A","muži skupina*",null,":",{"$nulls":7},"3-5",null,null,"Samuel Mesany ?,"]
["11:20:00","A","bronz ženy",null,":",{"$nulls":7},"4-1",null,null,"Adam Otčenáš 3,"]
[null,"B","muži skupina*",null,":",{"$nulls":7},"3-2",null,null,"Vojtěch Procházka 2"]
["12:30:00","A","finále do 15ti",null,":",{"$nulls":10},"Jan Učík B"]
[null,"B","muži skupina*",null,":",{"$nulls":7},"alternativa"]
["13:40:00","A","muži skupina*",null,":",{"$nulls":7},"3-2"]
["14:50:00","A","finále ženy",null,":",{"$nulls":7},"5-4"]
["16:30:00",null,"Vyhlášení",null,":",{"$nulls":7},"2-1"]
["* nedělní rozpis turnaje mužů bude přizpůsoben sobotním výsledkům tak, aby týmy s největší šancí na titul hrály poslední zápasy a BOB a BCI nehráli současně",{"$nulls":11},"3-5"]
[{"$nulls":12},"4-1"]

{"sheet":"Tabulka","index":4,"n_rows":20,"n_cols":9,"rows_kept":20,"hidden":true}
["MUŽI (M)",{"$f":"Rozpis!L1","v":"IKT"},{"$f":"Rozpis!L2","v":"RFG"},{"$f":"Rozpis!L3","v":"BOB"},{"$f":"Rozpis!L4","v":"HIG"},{"$f":"Rozpis!L5","v":"FAB"},"Skóre","Body","Pořadí"]
[{"$f":"Rozpis!K1","v":"Iktočante"},"X",":",":",":",":"]
[{"$f":"Rozpis!K2","v":"Refugees"},":","X",":",":",":"]
[{"$f":"Rozpis!K3","v":"Bobři"},":",":","X",":",":"]
[{"$f":"Rozpis!K4","v":"Highlander Zábřeh"},":",":",":","X",":"]
[{"$f":"Rozpis!K5","v":"Fabiáni Strašice"},":",":",":",":","X"]
[]
[]
["ŽENY (Ž)",{"$f":"Rozpis!L6","v":"FBZ"},{"$f":"Rozpis!L7","v":"TRI"},{"$f":"Rozpis!L8","v":"TYS"},{"$f":"Rozpis!L9","v":"PAK"},"Skóre","Body","Pořadí"]
[{"$f":"Rozpis!K6","v":"Fabiánky Strašice"},"X",":",":",":"]
[{"$f":"Rozpis!K7","v":"Trilobit beta"},":","X",":",":"]
[{"$f":"Rozpis!K8","v":"Tyšunky"},":",":","X",":"]
[{"$f":"Rozpis!K9","v":"Paka"},":",":",":","X"]
[]
[]
["Do 15ti let (D)",{"$f":"Rozpis!L10","v":"BCI"},{"$f":"Rozpis!L11","v":"LOW"},{"$f":"Rozpis!L12","v":"WAL"},{"$f":"Rozpis!L13","v":"STO"},"Skóre","Body","Pořadí"]
[{"$f":"Rozpis!K10","v":"Bobříci"},"X",":",":",":"]
[{"$f":"Rozpis!K11","v":"Lowlander Zábřeh"},":","X",":",":"]
[{"$f":"Rozpis!K12","v":"Wallowa"},":",":","X",":"]
[{"$f":"Rozpis!K13","v":"Stopaři"},":",":",":","X"]

{"sheet":"Statistiky","index":5,"n_rows":181,"n_cols":8,"rows_kept":181}
["jméno","tým","góly","nahrávky","kanada","tresty","úsp. bran.","ucastnik"]
[{"$f":"BOB!B9","v":"Jonáš Vodňanský"},{"$f":"BOB!$B$2","v":"BOB"},{"$f":"BOB!P9","v":15},{"$f":"BOB!Q9","v":9},{"$f":"C2+D2","v":24},{"$f":"BOB!AI9","v":0},{"$f":"BOB!AH9","v":{"v":0,"d":"0.00"}},{"$f":"CONCATENATE(IF(E2>0,1,IF(G2>0,2,IF(F2>0,3,\"\"))),IF(A2=0,\"žžž\",A2))","v":"1Jonáš Vodňanský"}]
[{"$f":"BOB!B7","v":"Kryštof Abel"},{"$f":"BOB!$B$2","v":"BOB"},{"$f":"BOB!P7","v":6},{"$f":"BOB!Q7","v":14},{"$f":"C3+D3","v":20},{"$f":"BOB!AI7","v":2},{"$f":"BOB!AH7","v":{"v":0,"d":"0.00"}},{"$f":"CONCATENATE(IF(E3>0,1,IF(G3>0,2,IF(F3>0,3,\"\"))),IF(A3=0,\"žžž\",A3))","v":"1Kryštof Abel"}]
[{"$f":"BOB!B6","v":"Matyáš Dolenský"},{"$f":"BOB!$B$2","v":"BOB"},{"$f":"BOB!P6","v":12},{"$f":"BOB!Q6","v":7},{"$f":"C4+D4","v":19},{"$f":"BOB!AI6","v":0},{"$f":"BOB!AH6","v":{"v":0,"d":"0.00"}},{"$f":"CONCATENATE(IF(E4>0,1,IF(G4>0,2,IF(F4>0,3,\"\"))),IF(A4=0,\"žžž\",A4))","v":"1Matyáš Dolenský"}]
[{"$f":"LOW!B5","v":"Jakub Holinka"},{"$f":"LOW!$B$2","v":"LOW"},{"$f":"LOW!P5","v":16},{"$f":"LOW!Q5","v":1},{"$f":"C5+D5","v":17},{"$f":"LOW!AI5","v":0},{"$f":"LOW!AH5","v":{"v":100,"d":"100.00"}},{"$f":"CONCATENATE(IF(E5>0,1,IF(G5>0,2,IF(F5>0,3,\"\"))),IF(A5=0,\"žžž\",A5))","v":"1Jakub Holinka"}]
[{"$f":"BOB!B8","v":"Emil Hejda"},{"$f":"BOB!$B$2","v":"BOB"},{"$f":"BOB!P8","v":15},{"$f":"BOB!Q8","v":2},{"$f":"C6+D6","v":17},{"$f":"BOB!AI8","v":0},{"$f":"BOB!AH8","v":{"v":0,"d":"0.00"}},{"$f":"CONCATENATE(IF(E6>0,1,IF(G6>0,2,IF(F6>0,3,\"\"))),IF(A6=0,\"žžž\",A6))","v":"1Emil Hejda"}]
[{"$f":"LOW!B6","v":"Hynek Matura"},{"$f":"LOW!$B$2","v":"LOW"},{"$f":"LOW!P6","v":11},{"$f":"LOW!Q6","v":6},{"$f":"C7+D7","v":17},{"$f":"LOW!AI6","v":0},{"$f":"LOW!AH6","v":{"v":0,"d":"0.00"}},{"$f":"CONCATENATE(IF(E7>0,1,IF(G7>0,2,IF(F7>0,3,\"\"))),IF(A7=0,\"žžž\",A7))","v":"1Hynek Matura"}]
[{"$f":"BOB!B4","v":"Eliáš Mesany"},{"$f":"BOB!$B$2","v":"BOB"},{"$f":"BOB!P4","v":7},{"$f":"BOB!Q4","v":9},{"$f":"C8+D8","v":16},{"$f":"BOB!AI4","v":0},{"$f":"BOB!AH4","v":{"v":0,"d":"0.00"}},{"$f":"CONCATENATE(IF(E8>0,1,IF(G8>0,2,IF(F8>0,3,\"\"))),IF(A8=0,\"žžž\",A8))","v":"1Eliáš Mesany"}]
[{"$f":"LOW!B8","v":"Jáchym Čech"},{"$f":"LOW!$B$2","v":"LOW"},{"$f":"LOW!P8","v":4},{"$f":"LOW!Q8","v":12},{"$f":"C9+D9","v":16},{"$f":"LOW!AI8","v":0},{"$f":"LOW!AH8","v":{"v":0,"d":"0.00"}},{"$f":"CONCATENATE(IF(E9>0,1,IF(G9>0,2,IF(F9>0,3,\"\"))),IF(A9=0,\"žžž\",A9))","v":"1Jáchym Čech"}]
[{"$f":"BCI!B5","v":"Marco Bubela *"},{"$f":"BCI!$B$2","v":"BCI"},{"$f":"BCI!P5","v":13},{"$f":"BCI!Q5","v":0},{"$f":"C10+D10","v":13},{"$f":"BCI!AI5","v":2},{"$f":"BCI!AH5","v":{"v":0,"d":"0.00"}},{"$f":"CONCATENATE(IF(E10>0,1,IF(G10>0,2,IF(F10>0,3,\"\"))),IF(A10=0,\"žžž\",A10))","v":"1Marco Bubela *"}]
[{"$f":"LOW!B7","v":"Václavek Filip"},{"$f":"LOW!$B$2","v":"LOW"},{"$f":"LOW!P7","v":9},{"$f":"LOW!Q7","v":2},{"$f":"C11+D11","v":11},{"$f":"LOW!AI7","v":0},{"$f":"LOW!AH7","v":{"v":52,"d":"52.00"}},{"$f":"CONCATENATE(IF(E11>0,1,IF(G11>0,2,IF(F11>0,3,\"\"))),IF(A11=0,\"žžž\",A11))","v":"1Václavek Filip"}]
[{"$f":"LOW!B9","v":"Lant Vít"},{"$f":"LOW!$B$2","v":"LOW"},{"$f":"LOW!P9","v":9},{"$f":"LOW!Q9","v":1},{"$f":"C12+D12","v":10},{"$f":"LOW!AI9","v":0},{"$f":"LOW!AH9","v":{"v":0,"d":"0.00"}},{"$f":"CONCATENATE(IF(E12>0,1,IF(G12>0,2,IF(F12>0,3,\"\"))),IF(A12=0,\"žžž\",A12))","v":"1Lant Vít"}]
[{"$f":"BOB!B5","v":"Vojtěch Procházka"},{"$f":"BOB!$B$2","v":"BOB"},{"$f":"BOB!P5","v":1},{"$f":"BOB!Q5","v":4},{"$f":"C13+D13","v":5},{"$f":"BOB!AI5","v":0},{"$f":"BOB!AH5","v":{"v":55.172413793103445,"d":"55.17"}},{"$f":"CONCATENATE(IF(E13>0,1,IF(G13>0,2,IF(F13>0,3,\"\"))),IF(A13=0,\"žžž\",A13))","v":"1Vojtěch Procházka"}]
[{"$f":"LOW!B10","v":"Lexman Martin *"},{"$f":"LOW!$B$2","v":"LOW"},{"$f":"LOW!P10","v":0},{"$f":"LOW!Q10","v":5},{"$f":"C14+D14","v":5},{"$f":"LOW!AI10","v":0},{"$f":"LOW!AH10","v":{"v":0,"d":"0.00"}},{"$f":"CONCATENATE(IF(E14>0,1,IF(G14>0,2,IF(F14>0,3,\"\"))),IF(A14=0,\"žžž\",A14))","v":"1Lexman Martin *"}]
[{"$f":"LOW!B4","v":"Lubojacký Robert"},{"$f":"LOW!$B$2","v":"LOW"},{"$f":"LOW!P4","v":1},{"$f":"LOW!Q4","v":3},{"$f":"C15+D15","v":4},{"$f":"LOW!AI4","v":0},{"$f":"LOW!AH4","v":{"v":81.81818181818181,"d":"81.82"}},{"$f":"CONCATENATE(IF(E15>0,1,IF(G15>0,2,IF(F15>0,3,\"\"))),IF(A15=0,\"žžž\",A15))","v":"1Lubojacký Robert"}]
[{"$f":"BCI!B9","v":"Jakub Vlášek *"},{"$f":"BCI!$B$2","v":"BCI"},{"$f":"BCI!P9","v":1},{"$f":"BCI!Q9","v":2},{"$f":"C16+D16","v":3},{"$f":"BCI!AI9","v":0},{"$f":"BCI!AH9","v":{"v":0,"d":"0.00"}},{"$f":"CONCATENATE(IF(E16>0,1,IF(G16>0,2,IF(F16>0,3,\"\"))),IF(A16=0,\"žžž\",A16))","v":"1Jakub Vlášek *"}]
[{"$f":"DEM!B7","v":"Adámek Albert *"},{"$f":"DEM!$B$2","v":"DEM"},{"$f":"DEM!P7","v":2},{"$f":"DEM!Q7","v":0},{"$f":"C17+D17","v":2},{"$f":"DEM!AI7","v":4},{"$f":"DEM!AH7","v":{"v":0,"d":"0.00"}},{"$f":"CONCATENATE(IF(E17>0,1,IF(G17>0,2,IF(F17>0,3,\"\"))),IF(A17=0,\"žžž\",A17))","v":"1Adámek Albert *"}]
[{"$f":"BCI!B8","v":"Vlášek Matěj"},{"$f":"BCI!$B$2","v":"BCI"},{"$f":"BCI!P8","v":1},{"$f":"BCI!Q8","v":0},{"$f":"C18+D18","v":1},{"$f":"BCI!AI8","v":0},{"$f":"BCI!AH8","v":{"v":0,"d":"0.00"}},{"$f":"CONCATENATE(IF(E18>0,1,IF(G18>0,2,IF(F18>0,3,\"\"))),IF(A18=0,\"žžž\",A18))","v":"1Vlášek Matěj"}]
[{"$f":"BCI!B10","v":"Josef Škoda"},{"$f":"BCI!$B$2","v":"BCI"},{"$f":"BCI!P10","v":0},{"$f":"BCI!Q10","v":1},{"$f":"C19+D19","v":1},{"$f":"BCI!AI10","v":0},{"$f":"BCI!AH10","v":{"v":0,"d":"0.00"}},{"$f":"CONCATENATE(IF(E19>0,1,IF(G19>0,2,IF(F19>0,3,\"\"))),IF(A19=0,\"žžž\",A19))","v":"1Josef Škoda"}]
[{"$f":"LOW!B11","v":"Lexman Jakub *"},{"$f":"LOW!$B$2","v":"LOW"},{"$f":"LOW!P11","v":0},{"$f":"LOW!Q11","v":1},{"$f":"C20+D20","v":1},{"$f":"LOW!AI11","v":0},{"$f":"LOW!AH11","v":{"v":0,"d":"0.00"}},{"$f":"CONCATENATE(IF(E20>0,1,IF(G20>0,2,IF(F20>0,3,\"\"))),IF(A20=0,\"žžž\",A20))","v":"1Lexman Jakub *"}]
[{"$f":"BCI!B11","v":"Emil Hejda BOB"},{"$f":"BCI!$B$2","v":"BCI"},{"$f":"BCI!P11","v":0},{"$f":"BCI!Q11","v":0},{"$f":"C21+D21","v":0},{"$f":"BCI!AI11","v":0},{"$f":"BCI!AH11","v":{"v":48.484848484848484,"d":"48.48"}},{"$f":"CONCATENATE(IF(E21>0,1,IF(G21>0,2,IF(F21>0,3,\"\"))),IF(A21=0,\"žžž\",A21))","v":"2Emil Hejda BOB"}]
[{"$f":"DEM!B5","v":"Fulín David *"},{"$f":"DEM!$B$2","v":"DEM"},{"$f":"DEM!P5","v":0},{"$f":"DEM!Q5","v":0},{"$f":"C22+D22","v":0},{"$f":"DEM!AI5","v":2},{"$f":"DEM!AH5","v":{"v":45.45454545454545,"d":"45.45"}},{"$f":"CONCATENATE(IF(E22>0,1,IF(G22>0,2,IF(F22>0,3,\"\"))),IF(A22=0,\"žžž\",A22))","v":"2Fulín David *"}]
[{"$f":"DEM!B8","v":"Sejková Berenika *"},{"$f":"DEM!$B$2","v":"DEM"},{"$f":"DEM!P8","v":0},{"$f":"DEM!Q8","v":0},{"$f":"C23+D23","v":0},{"$f":"DEM!AI8","v":0},{"$f":"DEM!AH8","v":{"v":32.432432432432435,"d":"32.43"}},{"$f":"CONCATENATE(IF(E23>0,1,IF(G23>0,2,IF(F23>0,3,\"\"))),IF(A23=0,\"žžž\",A23))","v":"2Sejková Berenika *"}]
[{"$f":"DEM!B9","v":"Sejková Viola *"},{"$f":"DEM!$B$2","v":"DEM"},{"$f":"DEM!P9","v":0},{"$f":"DEM!Q9","v":0},{"$f":"C24+D24","v":0},{"$f":"DEM!AI9","v":0},{"$f":"DEM!AH9","v":{"v":45,"d":"45.00"}},{"$f":"CONCATENATE(IF(E24>0,1,IF(G24>0,2,IF(F24>0,3,\"\"))),IF(A24=0,\"žžž\",A24))","v":"2Sejková Viola *"}]
[{"$f":"BCI!B7","v":"Vojtěch Kulič *"},{"$f":"BCI!$B$2","v":"BCI"},{"$f":"BCI!P7","v":0},{"$f":"BCI!Q7","v":0},{"$f":"C25+D25","v":0},{"$f":"BCI!AI7","v":0},{"$f":"BCI!AH7","v":{"v":32.142857142857146,"d":"32.14"}},{"$f":"CONCATENATE(IF(E25>0,1,IF(G25>0,2,IF(F25>0,3,\"\"))),IF(A25=0,\"žžž\",A25))","v":"2Vojtěch Kulič *"}]
[{"$f":"BCI!B12","v":"Vojtěch Procházka BOB"},{"$f":"BCI!$B$2","v":"BCI"},{"$f":"BCI!P12","v":0},{"$f":"BCI!Q12","v":0},{"$f":"C26+D26","v":0},{"$f":"BCI!AI12","v":0},{"$f":"BCI!AH12","v":{"v":93.33333333333333,"d":"93.33"}},{"$f":"CONCATENATE(IF(E26>0,1,IF(G26>0,2,IF(F26>0,3,\"\"))),IF(A26=0,\"žžž\",A26))","v":"2Vojtěch Procházka BOB"}]
[{"$f":"BCI!B6","v":"Lada Procházková *"},{"$f":"BCI!$B$2","v":"BCI"},{"$f":"BCI!P6","v":0},{"$f":"BCI!Q6","v":0},{"$f":"C27+D27","v":0},{"$f":"BCI!AI6","v":2},{"$f":"BCI!AH6","v":{"v":0,"d":"0.00"}},{"$f":"CONCATENATE(IF(E27>0,1,IF(G27>0,2,IF(F27>0,3,\"\"))),IF(A27=0,\"žžž\",A27))","v":"3Lada Procházková *"}]
[{"$f":"LOW!B12","v":"Dittrich Jakub"},{"$f":"LOW!$B$2","v":"LOW"},{"$f":"LOW!P12","v":0},{"$f":"LOW!Q12","v":0},{"$f":"C28+D28","v":0},{"$f":"LOW!AI12","v":0},{"$f":"LOW!AH12","v":{"v":0,"d":"0.00"}},{"$f":"CONCATENATE(IF(E28>0,1,IF(G28>0,2,IF(F28>0,3,\"\"))),IF(A28=0,\"žžž\",A28))","v":"Dittrich Jakub"}]
[{"$f":"DEM!B4","v":"Hofmanová Lenka"},{"$f":"DEM!$B$2","v":"DEM"},{"$f":"DEM!P4","v":0},{"$f":"DEM!Q4","v":0},{"$f":"C29+D29","v":0},{"$f":"DEM!AI4","v":0},{"$f":"DEM!AH4","v":{"v":0,"d":"0.00"}},{"$f":"CONCATENATE(IF(E29>0,1,IF(G29>0,2,IF(F29>0,3,\"\"))),IF(A29=0,\"žžž\",A29))","v":"Hofmanová Lenka"}]
[{"$f":"DEM!B12","v":"Jirovský Matyáš *"},{"$f":"DEM!$B$2","v":"DEM"},{"$f":"DEM!P12","v":0},{"$f":"DEM!Q12","v":0},{"$f":"C30+D30","v":0},{"$f":"DEM!AI12","v":0},{"$f":"DEM!AH12","v":{"v":0,"d":"0.00"}},{"$f":"CONCATENATE(IF(E30>0,1,IF(G30>0,2,IF(F30>0,3,\"\"))),IF(A30=0,\"žžž\",A30))","v":"Jirovský Matyáš *"}]
[{"$f":"BCI!B4","v":"Josef Byška"},{"$f":"BCI!$B$2","v":"BCI"},{"$f":"BCI!P4","v":0},{"$f":"BCI!Q4","v":0},{"$f":"C31+D31","v":0},{"$f":"BCI!AI4","v":0},{"$f":"BCI!AH4","v":{"v":0,"d":"0.00"}},{"$f":"CONCATENATE(IF(E31>0,1,IF(G31>0,2,IF(F31>0,3,\"\"))),IF(A31=0,\"žžž\",A31))","v":"Josef Byška"}]
[{"$f":"DEM!B6","v":"Krejčovská Michaela *"},{"$f":"DEM!$B$2","v":"DEM"},{"$f":"DEM!P6","v":0},{"$f":"DEM!Q6","v":0},{"$f":"C32+D32","v":0},{"$f":"DEM!AI6","v":0},{"$f":"DEM!AH6","v":{"v":0,"d":"0.00"}},{"$f":"CONCATENATE(IF(E32>0,1,IF(G32>0,2,IF(F32>0,3,\"\"))),IF(A32=0,\"žžž\",A32))","v":"Krejčovská Michaela *"}]
[{"$f":"DEM!B10","v":"Sejk Jáchym"},{"$f":"DEM!$B$2","v":"DEM"},{"$f":"DEM!P10","v":0},{"$f":"DEM!Q10","v":0},{"$f":"C33+D33","v":0},{"$f":"DEM!AI10","v":0},{"$f":"DEM!AH10","v":{"v":0,"d":"0.00"}},{"$f":"CONCATENATE(IF(E33>0,1,IF(G33>0,2,IF(F33>0,3,\"\"))),IF(A33=0,\"žžž\",A33))","v":"Sejk Jáchym"}]
[{"$f":"DEM!B11","v":"Vaněčková Dorota *"},{"$f":"DEM!$B$2","v":"DEM"},{"$f":"DEM!P11","v":0},{"$f":"DEM!Q11","v":0},{"$f":"C34+D34","v":0},{"$f":"DEM!AI11","v":0},{"$f":"DEM!AH11","v":{"v":0,"d":"0.00"}},{"$f":"CONCATENATE(IF(E34>0,1,IF(G34>0,2,IF(F34>0,3,\"\"))),IF(A34=0,\"žžž\",A34))","v":"Vaněčková Dorota *"}]
[{"$f":"BCI!B13","v":0},{"$f":"BCI!$B$2","v":"BCI"},{"$f":"BCI!P13","v":0},{"$f":"BCI!Q13","v":0},{"$f":"C35+D35","v":0},{"$f":"BCI!AI13","v":0},{"$f":"BCI!AH13","v":{"v":0,"d":"0.00"}},{"$f":"CONCATENATE(IF(E35>0,1,IF(G35>0,2,IF(F35>0,3,\"\"))),IF(A35=0,\"žžž\",A35))","v":"žžž"}]
[{"$f":"BCI!B14","v":0},{"$f":"BCI!$B$2","v":"BCI"},{"$f":"BCI!P14","v":0},{"$f":"BCI!Q14","v":0},{"$f":"C36+D36","v":0},{"$f":"BCI!AI14","v":0},{"$f":"BCI!AH14","v":{"v":0,"d":"0.00"}},{"$f":"CONCATENATE(IF(E36>0,1,IF(G36>0,2,IF(F36>0,3,\"\"))),IF(A36=0,\"žžž\",A36))","v":"žžž"}]
[{"$f":"BCI!B15","v":0},{"$f":"BCI!$B$2","v":"BCI"},{"$f":"BCI!P15","v":0},{"$f":"BCI!Q15","v":0},{"$f":"C37+D37","v":0},{"$f":"BCI!AI15","v":0},{"$f":"BCI!AH15","v":{"v":0,"d":"0.00"}},{"$f":"CONCATENATE(IF(E37>0,1,IF(G37>0,2,IF(F37>0,3,\"\"))),IF(A37=0,\"žžž\",A37))","v":"žžž"}]
[{"$f":"BCI!B16","v":0},{"$f":"BCI!$B$2","v":"BCI"},{"$f":"BCI!P16","v":0},{"$f":"BCI!Q16","v":0},{"$f":"C38+D38","v":0},{"$f":"BCI!AI16","v":0},{"$f":"BCI!AH16","v":{"v":0,"d":"0.00"}},{"$f":"CONCATENATE(IF(E38>0,1,IF(G38>0,2,IF(F38>0,3,\"\"))),IF(A38=0,\"žžž\",A38))","v":"žžž"}]
[{"$f":"BCI!B17","v":0},{"$f":"BCI!$B$2","v":"BCI"},{"$f":"BCI!P17","v":0},{"$f":"BCI!Q17","v":0},{"$f":"C39+D39","v":0},{"$f":"BCI!AI17","v":0},{"$f":"BCI!AH17","v":{"v":0,"d":"0.00"}},{"$f":"CONCATENATE(IF(E39>0,1,IF(G39>0,2,IF(F39>0,3,\"\"))),IF(A39=0,\"žžž\",A39))","v":"žžž"}]
[{"$f":"BCI!B18","v":0},{"$f":"BCI!$B$2","v":"BCI"},{"$f":"BCI!P18","v":0},{"$f":"BCI!Q18","v":0},{"$f":"C40+D40","v":0},{"$f":"BCI!AI18","v":0},{"$f":"BCI!AH18","v":{"v":0,"d":"0.00"}},{"$f":"CONCATENATE(IF(E40>0,1,IF(G40>0,2,IF(F40>0,3,\"\"))),IF(A40=0,\"žžž\",A40))","v":"žžž"}]
[{"$f":"BCI!B19","v":0},{"$f":"BCI!$B$2","v":"BCI"},{"$f":"BCI!P19","v":0},{"$f":"BCI!Q19","v":0},{"$f":"C41+D41","v":0},{"$f":"BCI!AI19","v":0},{"$f":"BCI!AH19","v":{"v":0,"d":"0.00"}},{"$f":"CONCATENATE(IF(E41>0,1,IF(G41>0,2,IF(F41>0,3,\"\"))),IF(A41=0,\"žžž\",A41))","v":"žžž"}]
[{"$f":"BCI!B20","v":0},{"$f":"BCI!$B$2","v":"BCI"},{"$f":"BCI!P20","v":0},{"$f":"BCI!Q20","v":0},{"$f":"C42+D42","v":0},{"$f":"BCI!AI20","v":0},{"$f":"BCI!AH20","v":{"v":0,"d":"0.00"}},{"$f":"CONCATENATE(IF(E42>0,1,IF(G42>0,2,IF(F42>0,3,\"\"))),IF(A42=0,\"žžž\",A42))","v":"žžž"}]
[{"$f":"BCI!B21","v":0},{"$f":"BCI!$B$2","v":"BCI"},{"$f":"BCI!P21","v":0},{"$f":"BCI!Q21","v":0},{"$f":"C43+D43","v":0},{"$f":"BCI!AI21","v":0},{"$f":"BCI!AH21","v":{"v":0,"d":"0.00"}},{"$f":"CONCATENATE(IF(E43>0,1,IF(G43>0,2,IF(F43>0,3,\"\"))),IF(A43=0,\"žžž\",A43))","v":"žžž"}]
[{"$f":"BCI!B22","v":0},{"$f":"BCI!$B$2","v":"BCI"},{"$f":"BCI!P22","v":0},{"$f":"BCI!Q22","v":0},{"$f":"C44+D44","v":0},{"$f":"BCI!AI22","v":0},{"$f":"BCI!AH22","v":{"v":0,"d":"0.00"}},{"$f":"CONCATENATE(IF(E44>0,1,IF(G44>0,2,IF(F44>0,3,\"\"))),IF(A44=0,\"žžž\",A44))","v":"žžž"}]
[{"$f":"BCI!B23","v":0},{"$f":"BCI!$B$2","v":"BCI"},{"$f":"BCI!P23","v":0},{"$f":"BCI!Q23","v":0},{"$f":"C45+D45","v":0},{"$f":"BCI!AI23","v":0},{"$f":"BCI!AH23","v":{"v":0,"d":"0.00"}},{"$f":"CONCATENATE(IF(E45>0,1,IF(G45>0,2,IF(F45>0,3,\"\"))),IF(A45=0,\"žžž\",A45))","v":"žžž"}]
[{"$f":"BCI!B24","v":0},{"$f":"BCI!$B$2","v":"BCI"},{"$f":"BCI!P24","v":0},{"$f":"BCI!Q24","v":0},{"$f":"C46+D46","v":0},{"$f":"BCI!AI24","v":0},{"$f":"BCI!AH24","v":{"v":0,"d":"0.00"}},{"$f":"CONCATENATE(IF(E46>0,1,IF(G46>0,2,IF(F46>0,3,\"\"))),IF(A46=0,\"žžž\",A46))","v":"žžž"}]
[{"$f":"BCI!B25","v":0},{"$f":"BCI!$B$2","v":"BCI"},{"$f":"BCI!P25","v":0},{"$f":"BCI!Q25","v":0},{"$f":"C47+D47","v":0},{"$f":"BCI!AI25","v":0},{"$f":"BCI!AH25","v":{"v":0,"d":"0.00"}},{"$f":"CONCATENATE(IF(E47>0,1,IF(G47>0,2,IF(F47>0,3,\"\"))),IF(A47=0,\"žžž\",A47))","v":"žžž"}]
[{"$f":"BCI!B26","v":0},{"$f":"BCI!$B$2","v":"BCI"},{"$f":"BCI!P26","v":0},{"$f":"BCI!Q26","v":0},{"$f":"C48+D48","v":0},{"$f":"BCI!AI26","v":0},{"$f":"BCI!AH26","v":{"v":0,"d":"0.00"}},{"$f":"CONCATENATE(IF(E48>0,1,IF(G48>0,2,IF(F48>0,3,\"\"))),IF(A48=0,\"žžž\",A48))","v":"žžž"}]
[{"$f":"BCI!B27","v":0},{"$f":"BCI!$B$2","v":"BCI"},{"$f":"BCI!P27","v":0},{"$f":"BCI!Q27","v":0},{"$f":"C49+D49","v":0},{"$f":"BCI!AI27","v":0},{"$f":"BCI!AH27","v":{"v":0,"d":"0.00"}},{"$f":"CONCATENATE(IF(E49>0,1,IF(G49>0,2,IF(F49>0,3,\"\"))),IF(A49=0,\"žžž\",A49))","v":"žžž"}]
[{"$f":"BCI!B28","v":0},{"$f":"BCI!$B$2","v":"BCI"},{"$f":"BCI!P28","v":0},{"$f":"BCI!Q28","v":0},{"$f":"C50+D50","v":0},{"$f":"BCI!AI28","v":0},{"$f":"BCI!AH28","v":{"v":0,"d":"0.00"}},{"$f":"CONCATENATE(IF(E50>0,1,IF(G50>0,2,IF(F50>0,3,\"\"))),IF(A50=0,\"žžž\",A50))","v":"žžž"}]
[{"$f":"BCI!B29","v":0},{"$f":"BCI!$B$2","v":"BCI"},{"$f":"BCI!P29","v":0},{"$f":"BCI!Q29","v":0},{"$f":"C51+D51","v":0},{"$f":"BCI!AI29","v":0},{"$f":"BCI!AH29","v":{"v":0,"d":"0.00"}},{"$f":"CONCATENATE(IF(E51>0,1,IF(G51>0,2,IF(F51>0,3,\"\"))),IF(A51=0,\"žžž\",A51))","v":"žžž"}]
[{"$f":"BCI!B30","v":0},{"$f":"BCI!$B$2","v":"BCI"},{"$f":"BCI!P30","v":0},{"$f":"BCI!Q30","v":0},{"$f":"C52+D52","v":0},{"$f":"BCI!AI30","v":0},{"$f":"BCI!AH30","v":{"v":0,"d":"0.00"}},{"$f":"CONCATENATE(IF(E52>0,1,IF(G52>0,2,IF(F52>0,3,\"\"))),IF(A52=0,\"žžž\",A52))","v":"žžž"}]
[{"$f":"BCI!B31","v":0},{"$f":"BCI!$B$2","v":"BCI"},{"$f":"BCI!P31","v":0},{"$f":"BCI!Q31","v":0},{"$f":"C53+D53","v":0},{"$f":"BCI!AI31","v":0},{"$f":"BCI!AH31","v":{"v":0,"d":"0.00"}},{"$f":"CONCATENATE(IF(E53>0,1,IF(G53>0,2,IF(F53>0,3,\"\"))),IF(A53=0,\"žžž\",A53))","v":"žžž"}]
[{"$f":"BCI!B32","v":0},{"$f":"BCI!$B$2","v":"BCI"},{"$f":"BCI!P32","v":0},{"$f":"BCI!Q32","v":0},{"$f":"C54+D54","v":0},{"$f":"BCI!AI32","v":0},{"$f":"BCI!AH32","v":{"v":0,"d":"0.00"}},{"$f":"CONCATENATE(IF(E54>0,1,IF(G54>0,2,IF(F54>0,3,\"\"))),IF(A54=0,\"žžž\",A54))","v":"žžž"}]
[{"$f":"BCI!B33","v":0},{"$f":"BCI!$B$2","v":"BCI"},{"$f":"BCI!P33","v":0},{"$f":"BCI!Q33","v":0},{"$f":"C55+D55","v":0},{"$f":"BCI!AI33","v":0},{"$f":"BCI!AH33","v":{"v":0,"d":"0.00"}},{"$f":"CONCATENATE(IF(E55>0,1,IF(G55>0,2,IF(F55>0,3,\"\"))),IF(A55=0,\"žžž\",A55))","v":"žžž"}]
[{"$f":"LOW!B13","v":0},{"$f":"LOW!$B$2","v":"LOW"},{"$f":"LOW!P13","v":0},{"$f":"LOW!Q13","v":0},{"$f":"C56+D56","v":0},{"$f":"LOW!AI13","v":0},{"$f":"LOW!AH13","v":{"v":0,"d":"0.00"}},{"$f":"CONCATENATE(IF(E56>0,1,IF(G56>0,2,IF(F56>0,3,\"\"))),IF(A56=0,\"žžž\",A56))","v":"žžž"}]
[{"$f":"LOW!B14","v":0},{"$f":"LOW!$B$2","v":"LOW"},{"$f":"LOW!P14","v":0},{"$f":"LOW!Q14","v":0},{"$f":"C57+D57","v":0},{"$f":"LOW!AI14","v":0},{"$f":"LOW!AH14","v":{"v":0,"d":"0.00"}},{"$f":"CONCATENATE(IF(E57>0,1,IF(G57>0,2,IF(F57>0,3,\"\"))),IF(A57=0,\"žžž\",A57))","v":"žžž"}]
[{"$f":"LOW!B15","v":0},{"$f":"LOW!$B$2","v":"LOW"},{"$f":"LOW!P15","v":0},{"$f":"LOW!Q15","v":0},{"$f":"C58+D58","v":0},{"$f":"LOW!AI15","v":0},{"$f":"LOW!AH15","v":{"v":0,"d":"0.00"}},{"$f":"CONCATENATE(IF(E58>0,1,IF(G58>0,2,IF(F58>0,3,\"\"))),IF(A58=0,\"žžž\",A58))","v":"žžž"}]
[{"$f":"LOW!B16","v":0},{"$f":"LOW!$B$2","v":"LOW"},{"$f":"LOW!P16","v":0},{"$f":"LOW!Q16","v":0},{"$f":"C59+D59","v":0},{"$f":"LOW!AI16","v":0},{"$f":"LOW!AH16","v":{"v":0,"d":"0.00"}},{"$f":"CONCATENATE(IF(E59>0,1,IF(G59>0,2,IF(F59>0,3,\"\"))),IF(A59=0,\"žžž\",A59))","v":"žžž"}]
[{"$f":"LOW!B17","v":0},{"$f":"LOW!$B$2","v":"LOW"},{"$f":"LOW!P17","v":0},{"$f":"LOW!Q17","v":0},{"$f":"C60+D60","v":0},{"$f":"LOW!AI17","v":0},{"$f":"LOW!AH17","v":{"v":0,"d":"0.00"}},{"$f":"CONCATENATE(IF(E60>0,1,IF(G60>0,2,IF(F60>0,3,\"\"))),IF(A60=0,\"žžž\",A60))","v":"žžž"}]
[{"$f":"LOW!B18","v":0},{"$f":"LOW!$B$2","v":"LOW"},{"$f":"LOW!P18","v":0},{"$f":"LOW!Q18","v":0},{"$f":"C61+D61","v":0},{"$f":"LOW!AI18","v":0},{"$f":"LOW!AH18","v":{"v":0,"d":"0.00"}},{"$f":"CONCATENATE(IF(E61>0,1,IF(G61>0,2,IF(F61>0,3,\"\"))),IF(A61=0,\"žžž\",A61))","v":"žžž"}]
[{"$f":"LOW!B19","v":0},{"$f":"LOW!$B$2","v":"LOW"},{"$f":"LOW!P19","v":0},{"$f":"LOW!Q19","v":0},{"$f":"C62+D62","v":0},{"$f":"LOW!AI19","v":0},{"$f":"LOW!AH19","v":{"v":0,"d":"0.00"}},{"$f":"CONCATENATE(IF(E62>0,1,IF(G62>0,2,IF(F62>0,3,\"\"))),IF(A62=0,\"žžž\",A62))","v":"žžž"}]
[{"$f":"LOW!B20","v":0},{"$f":"LOW!$B$2","v":"LOW"},{"$f":"LOW!P20","v":0},{"$f":"LOW!Q20","v":0},{"$f":"C63+D63","v":0},{"$f":"LOW!AI20","v":0},{"$f":"LOW!AH20","v":{"v":0,"d":"0.00"}},{"$f":"CONCATENATE(IF(E63>0,1,IF(G63>0,2,IF(F63>0,3,\"\"))),IF(A63=0,\"žžž\",A63))","v":"žžž"}]
[{"$f":"LOW!B21","v":0},{"$f":"LOW!$B$2","v":"LOW"},{"$f":"LOW!P21","v":0},{"$f":"LOW!Q21","v":0},{"$f":"C64+D64","v":0},{"$f":"LOW!AI21","v":0},{"$f":"LOW!AH21","v":{"v":0,"d":"0.00"}},{"$f":"CONCATENATE(IF(E64>0,1,IF(G64>0,2,IF(F64>0,3,\"\"))),IF(A64=0,\"žžž\",A64))","v":"žžž"}]
[{"$f":"LOW!B22","v":0},{"$f":"LOW!$B$2","v":"LOW"},{"$f":"LOW!P22","v":0},{"$f":"LOW!Q22","v":0},{"$f":"C65+D65","v":0},{"$f":"LOW!AI22","v":0},{"$f":"LOW!AH22","v":{"v":0,"d":"0.00"}},{"$f":"CONCATENATE(IF(E65>0,1,IF(G65>0,2,IF(F65>0,3,\"\"))),IF(A65=0,\"žžž\",A65))","v":"žžž"}]
[{"$f":"LOW!B23","v":0},{"$f":"LOW!$B$2","v":"LOW"},{"$f":"LOW!P23","v":0},{"$f":"LOW!Q23","v":0},{"$f":"C66+D66","v":0},{"$f":"LOW!AI23","v":0},{"$f":"LOW!AH23","v":{"v":0,"d":"0.00"}},{"$f":"CONCATENATE(IF(E66>0,1,IF(G66>0,2,IF(F66>0,3,\"\"))),IF(A66=0,\"žžž\",A66))","v":"žžž"}]
[{"$f":"LOW!B24","v":0},{"$f":"LOW!$B$2","v":"LOW"},{"$f":"LOW!P24","v":0},{"$f":"LOW!Q24","v":0},{"$f":"C67+D67","v":0},{"$f":"LOW!AI24","v":0},{"$f":"LOW!AH24","v":{"v":0,"d":"0.00"}},{"$f":"CONCATENATE(IF(E67>0,1,IF(G67>0,2,IF(F67>0,3,\"\"))),IF(A67=0,\"žžž\",A67))","v":"žžž"}]
[{"$f":"LOW!B25","v":0},{"$f":"LOW!$B$2","v":"LOW"},{"$f":"LOW!P25","v":0},{"$f":"LOW!Q25","v":0},{"$f":"C68+D68","v":0},{"$f":"LOW!AI25","v":0},{"$f":"LOW!AH25","v":{"v":0,"d":"0.00"}},{"$f":"CONCATENATE(IF(E68>0,1,IF(G68>0,2,IF(F68>0,3,\"\"))),IF(A68=0,\"žžž\",A68))","v":"žžž"}]
[{"$f":"LOW!B26","v":0},{"$f":"LOW!$B$2","v":"LOW"},{"$f":"LOW!P26","v":0},{"$f":"LOW!Q26","v":0},{"$f":"C69+D69","v":0},{"$f":"LOW!AI26","v":0},{"$f":"LOW!AH26","v":{"v":0,"d":"0.00"}},{"$f":"CONCATENATE(IF(E69>0,1,IF(G69>0,2,IF(F69>0,3,\"\"))),IF(A69=0,\"žžž\",A69))","v":"žžž"}]
[{"$f":"LOW!B27","v":0},{"$f":"LOW!$B$2","v":"LOW"},{"$f":"LOW!P27","v":0},{"$f":"LOW!Q27","v":0},{"$f":"C70+D70","v":0},{"$f":"LOW!AI27","v":0},{"$f":"LOW!AH27","v":{"v":0,"d":"0.00"}},{"$f":"CONCATENATE(IF(E70>0,1,IF(G70>0,2,IF(F70>0,3,\"\"))),IF(A70=0,\"žžž\",A70))","v":"žžž"}]
[{"$f":"LOW!B28","v":0},{"$f":"LOW!$B$2","v":"LOW"},{"$f":"LOW!P28","v":0},{"$f":"LOW!Q28","v":0},{"$f":"C71+D71","v":0},{"$f":"LOW!AI28","v":0},{"$f":"LOW!AH28","v":{"v":0,"d":"0.00"}},{"$f":"CONCATENATE(IF(E71>0,1,IF(G71>0,2,IF(F71>0,3,\"\"))),IF(A71=0,\"žžž\",A71))","v":"žžž"}]
[{"$f":"LOW!B29","v":0},{"$f":"LOW!$B$2","v":"LOW"},{"$f":"LOW!P29","v":0},{"$f":"LOW!Q29","v":0},{"$f":"C72+D72","v":0},{"$f":"LOW!AI29","v":0},{"$f":"LOW!AH29","v":{"v":0,"d":"0.00"}},{"$f":"CONCATENATE(IF(E72>0,1,IF(G72>0,2,IF(F72>0,3,\"\"))),IF(A72=0,\"žžž\",A72))","v":"žžž"}]
[{"$f":"LOW!B30","v":0},{"$f":"LOW!$B$2","v":"LOW"},{"$f":"LOW!P30","v":0},{"$f":"LOW!Q30","v":0},{"$f":"C73+D73","v":0},{"$f":"LOW!AI30","v":0},{"$f":"LOW!AH30","v":{"v":0,"d":"0.00"}},{"$f":"CONCATENATE(IF(E73>0,1,IF(G73>0,2,IF(F73>0,3,\"\"))),IF(A73=0,\"žžž\",A73))","v":"žžž"}]
[{"$f":"LOW!B31","v":0},{"$f":"LOW!$B$2","v":"LOW"},{"$f":"LOW!P31","v":0},{"$f":"LOW!Q31","v":0},{"$f":"C74+D74","v":0},{"$f":"LOW!AI31","v":0},{"$f":"LOW!AH31","v":{"v":0,"d":"0.00"}},{"$f":"CONCATENATE(IF(E74>0,1,IF(G74>0,2,IF(F74>0,3,\"\"))),IF(A74=0,\"žžž\",A74))","v":"žžž"}]
[{"$f":"LOW!B32","v":0},{"$f":"LOW!$B$2","v":"LOW"},{"$f":"LOW!P32","v":0},{"$f":"LOW!Q32","v":0},{"$f":"C75+D75","v":0},{"$f":"LOW!AI32","v":0},{"$f":"LOW!AH32","v":{"v":0,"d":"0.00"}},{"$f":"CONCATENATE(IF(E75>0,1,IF(G75>0,2,IF(F75>0,3,\"\"))),IF(A75=0,\"žžž\",A75))","v":"žžž"}]
[{"$f":"LOW!B33","v":0},{"$f":"LOW!$B$2","v":"LOW"},{"$f":"LOW!P33","v":0},{"$f":"LOW!Q33","v":0},{"$f":"C76+D76","v":0},{"$f":"LOW!AI33","v":0},{"$f":"LOW!AH33","v":{"v":0,"d":"0.00"}},{"$f":"CONCATENATE(IF(E76>0,1,IF(G76>0,2,IF(F76>0,3,\"\"))),IF(A76=0,\"žžž\",A76))","v":"žžž"}]
[{"$f":"BOB!B10","v":0},{"$f":"BOB!$B$2","v":"BOB"},{"$f":"BOB!P10","v":0},{"$f":"BOB!Q10","v":0},{"$f":"C77+D77","v":0},{"$f":"BOB!AI10","v":0},{"$f":"BOB!AH10","v":{"v":0,"d":"0.00"}},{"$f":"CONCATENATE(IF(E77>0,1,IF(G77>0,2,IF(F77>0,3,\"\"))),IF(A77=0,\"žžž\",A77))","v":"žžž"}]
[{"$f":"BOB!B11","v":0},{"$f":"BOB!$B$2","v":"BOB"},{"$f":"BOB!P11","v":0},{"$f":"BOB!Q11","v":0},{"$f":"C78+D78","v":0},{"$f":"BOB!AI11","v":0},{"$f":"BOB!AH11","v":{"v":0,"d":"0.00"}},{"$f":"CONCATENATE(IF(E78>0,1,IF(G78>0,2,IF(F78>0,3,\"\"))),IF(A78=0,\"žžž\",A78))","v":"žžž"}]
[{"$f":"BOB!B12","v":0},{"$f":"BOB!$B$2","v":"BOB"},{"$f":"BOB!P12","v":0},{"$f":"BOB!Q12","v":0},{"$f":"C79+D79","v":0},{"$f":"BOB!AI12","v":0},{"$f":"BOB!AH12","v":{"v":0,"d":"0.00"}},{"$f":"CONCATENATE(IF(E79>0,1,IF(G79>0,2,IF(F79>0,3,\"\"))),IF(A79=0,\"žžž\",A79))","v":"žžž"}]
[{"$f":"BOB!B13","v":0},{"$f":"BOB!$B$2","v":"BOB"},{"$f":"BOB!P13","v":0},{"$f":"BOB!Q13","v":0},{"$f":"C80+D80","v":0},{"$f":"BOB!AI13","v":0},{"$f":"BOB!AH13","v":{"v":0,"d":"0.00"}},{"$f":"CONCATENATE(IF(E80>0,1,IF(G80>0,2,IF(F80>0,3,\"\"))),IF(A80=0,\"žžž\",A80))","v":"žžž"}]
[{"$f":"BOB!B14","v":0},{"$f":"BOB!$B$2","v":"BOB"},{"$f":"BOB!P14","v":0},{"$f":"BOB!Q14","v":0},{"$f":"C81+D81","v":0},{"$f":"BOB!AI14","v":0},{"$f":"BOB!AH14","v":{"v":0,"d":"0.00"}},{"$f":"CONCATENATE(IF(E81>0,1,IF(G81>0,2,IF(F81>0,3,\"\"))),IF(A81=0,\"žžž\",A81))","v":"žžž"}]
[{"$f":"BOB!B15","v":0},{"$f":"BOB!$B$2","v":"BOB"},{"$f":"BOB!P15","v":0},{"$f":"BOB!Q15","v":0},{"$f":"C82+D82","v":0},{"$f":"BOB!AI15","v":0},{"$f":"BOB!AH15","v":{"v":0,"d":"0.00"}},{"$f":"CONCATENATE(IF(E82>0,1,IF(G82>0,2,IF(F82>0,3,\"\"))),IF(A82=0,\"žžž\",A82))","v":"žžž"}]
[{"$f":"BOB!B16","v":0},{"$f":"BOB!$B$2","v":"BOB"},{"$f":"BOB!P16","v":0},{"$f":"BOB!Q16","v":0},{"$f":"C83+D83","v":0},{"$f":"BOB!AI16","v":0},{"$f":"BOB!AH16","v":{"v":0,"d":"0.00"}},{"$f":"CONCATENATE(IF(E83>0,1,IF(G83>0,2,IF(F83>0,3,\"\"))),IF(A83=0,\"žžž\",A83))","v":"žžž"}]
[{"$f":"BOB!B17","v":0},{"$f":"BOB!$B$2","v":"BOB"},{"$f":"BOB!P17","v":0},{"$f":"BOB!Q17","v":0},{"$f":"C84+D84","v":0},{"$f":"BOB!AI17","v":0},{"$f":"BOB!AH17","v":{"v":0,"d":"0.00"}},{"$f":"CONCATENATE(IF(E84>0,1,IF(G84>0,2,IF(F84>0,3,\"\"))),IF(A84=0,\"žžž\",A84))","v":"žžž"}]
[{"$f":"BOB!B18","v":0},{"$f":"BOB!$B$2","v":"BOB"},{"$f":"BOB!P18","v":0},{"$f":"BOB!Q18","v":0},{"$f":"C85+D85","v":0},{"$f":"BOB!AI18","v":0},{"$f":"BOB!AH18","v":{"v":0,"d":"0.00"}},{"$f":"CONCATENATE(IF(E85>0,1,IF(G85>0,2,IF(F85>0,3,\"\"))),IF(A85=0,\"žžž\",A85))","v":"žžž"}]
[{"$f":"BOB!B19","v":0},{"$f":"BOB!$B$2","v":"BOB"},{"$f":"BOB!P19","v":0},{"$f":"BOB!Q19","v":0},{"$f":"C86+D86","v":0},{"$f":"BOB!AI19","v":0},{"$f":"BOB!AH19","v":{"v":0,"d":"0.00"}},{"$f":"CONCATENATE(IF(E86>0,1,IF(G86>0,2,IF(F86>0,3,\"\"))),IF(A86=0,\"žžž\",A86))","v":"žžž"}]
[{"$f":"BOB!B20","v":0},{"$f":"BOB!$B$2","v":"BOB"},{"$f":"BOB!P20","v":0},{"$f":"BOB!Q20","v":0},{"$f":"C87+D87","v":0},{"$f":"BOB!AI20","v":0},{"$f":"BOB!AH20","v":{"v":0,"d":"0.00"}},{"$f":"CONCATENATE(IF(E87>0,1,IF(G87>0,2,IF(F87>0,3,\"\"))),IF(A87=0,\"žžž\",A87))","v":"žžž"}]
[{"$f":"BOB!B21","v":0},{"$f":"BOB!$B$2","v":"BOB"},{"$f":"BOB!P21","v":0},{"$f":"BOB!Q21","v":0},{"$f":"C88+D88","v":0},{"$f":"BOB!AI21","v":0},{"$f":"BOB!AH21","v":{"v":0,"d":"0.00"}},{"$f":"CONCATENATE(IF(E88>0,1,IF(G88>0,2,IF(F88>0,3,\"\"))),IF(A88=0,\"žžž\",A88))","v":"žžž"}]
[{"$f":"BOB!B22","v":0},{"$f":"BOB!$B$2","v":"BOB"},{"$f":"BOB!P22","v":0},{"$f":"BOB!Q22","v":0},{"$f":"C89+D89","v":0},{"$f":"BOB!AI22","v":0},{"$f":"BOB!AH22","v":{"v":0,"d":"0.00"}},{"$f":"CONCATENATE(IF(E89>0,1,IF(G89>0,2,IF(F89>0,3,\"\"))),IF(A89=0,\"žžž\",A89))","v":"žžž"}]
[{"$f":"BOB!B23","v":0},{"$f":"BOB!$B$2","v":"BOB"},{"$f":"BOB!P23","v":0},{"$f":"BOB!Q23","v":0},{"$f":"C90+D90","v":0},{"$f":"BOB!AI23","v":0},{"$f":"BOB!AH23","v":{"v":0,"d":"0.00"}},{"$f":"CONCATENATE(IF(E90>0,1,IF(G90>0,2,IF(F90>0,3,\"\"))),IF(A90=0,\"žžž\",A90))","v":"žžž"}]
[{"$f":"BOB!B24","v":0},{"$f":"BOB!$B$2","v":"BOB"},{"$f":"BOB!P24","v":0},{"$f":"BOB!Q24","v":0},{"$f":"C91+D91","v":0},{"$f":"BOB!AI24","v":0},{"$f":"BOB!AH24","v":{"v":0,"d":"0.00"}},{"$f":"CONCATENATE(IF(E91>0,1,IF(G91>0,2,IF(F91>0,3,\"\"))),IF(A91=0,\"žžž\",A91))","v":"žžž"}]
[{"$f":"BOB!B25","v":0},{"$f":"BOB!$B$2","v":"BOB"},{"$f":"BOB!P25","v":0},{"$f":"BOB!Q25","v":0},{"$f":"C92+D92","v":0},{"$f":"BOB!AI25","v":0},{"$f":"BOB!AH25","v":{"v":0,"d":"0.00"}},{"$f":"CONCATENATE(IF(E92>0,1,IF(G92>0,2,IF(F92>0,3,\"\"))),IF(A92=0,\"žžž\",A92))","v":"žžž"}]
[{"$f":"BOB!B26","v":0},{"$f":"BOB!$B$2","v":"BOB"},{"$f":"BOB!P26","v":0},{"$f":"BOB!Q26","v":0},{"$f":"C93+D93","v":0},{"$f":"BOB!AI26","v":0},{"$f":"BOB!AH26","v":{"v":0,"d":"0.00"}},{"$f":"CONCATENATE(IF(E93>0,1,IF(G93>0,2,IF(F93>0,3,\"\"))),IF(A93=0,\"žžž\",A93))","v":"žžž"}]
[{"$f":"BOB!B27","v":0},{"$f":"BOB!$B$2","v":"BOB"},{"$f":"BOB!P27","v":0},{"$f":"BOB!Q27","v":0},{"$f":"C94+D94","v":0},{"$f":"BOB!AI27","v":0},{"$f":"BOB!AH27","v":{"v":0,"d":"0.00"}},{"$f":"CONCATENATE(IF(E94>0,1,IF(G94>0,2,IF(F94>0,3,\"\"))),IF(A94=0,\"žžž\",A94))","v":"žžž"}]
[{"$f":"BOB!B28","v":0},{"$f":"BOB!$B$2","v":"BOB"},{"$f":"BOB!P28","v":0},{"$f":"BOB!Q28","v":0},{"$f":"C95+D95","v":0},{"$f":"BOB!AI28","v":0},{"$f":"BOB!AH28","v":{"v":0,"d":"0.00"}},{"$f":"CONCATENATE(IF(E95>0,1,IF(G95>0,2,IF(F95>0,3,\"\"))),IF(A95=0,\"žžž\",A95))","v":"žžž"}]
[{"$f":"BOB!B29","v":0},{"$f":"BOB!$B$2","v":"BOB"},{"$f":"BOB!P29","v":0},{"$f":"BOB!Q29","v":0},{"$f":"C96+D96","v":0},{"$f":"BOB!AI29","v":0},{"$f":"BOB!AH29","v":{"v":0,"d":"0.00"}},{"$f":"CONCATENATE(IF(E96>0,1,IF(G96>0,2,IF(F96>0,3,\"\"))),IF(A96=0,\"žžž\",A96))","v":"žžž"}]
[{"$f":"BOB!B30","v":0},{"$f":"BOB!$B$2","v":"BOB"},{"$f":"BOB!P30","v":0},{"$f":"BOB!Q30","v":0},{"$f":"C97+D97","v":0},{"$f":"BOB!AI30","v":0},{"$f":"BOB!AH30","v":{"v":0,"d":"0.00"}},{"$f":"CONCATENATE(IF(E97>0,1,IF(G97>0,2,IF(F97>0,3,\"\"))),IF(A97=0,\"žžž\",A97))","v":"žžž"}]
[{"$f":"BOB!B31","v":0},{"$f":"BOB!$B$2","v":"BOB"},{"$f":"BOB!P31","v":0},{"$f":"BOB!Q31","v":0},{"$f":"C98+D98","v":0},{"$f":"BOB!AI31","v":0},{"$f":"BOB!AH31","v":{"v":0,"d":"0.00"}},{"$f":"CONCATENATE(IF(E98>0,1,IF(G98>0,2,IF(F98>0,3,\"\"))),IF(A98=0,\"žžž\",A98))","v":"žžž"}]
[{"$f":"BOB!B32","v":0},{"$f":"BOB!$B$2","v":"BOB"},{"$f":"BOB!P32","v":0},{"$f":"BOB!Q32","v":0},{"$f":"C99+D99","v":0},{"$f":"BOB!AI32","v":0},{"$f":"BOB!AH32","v":{"v":0,"d":"0.00"}},{"$f":"CONCATENATE(IF(E99>0,1,IF(G99>0,2,IF(F99>0,3,\"\"))),IF(A99=0,\"žžž\",A99))","v":"žžž"}]
[{"$f":"BOB!B33","v":0},{"$f":"BOB!$B$2","v":"BOB"},{"$f":"BOB!P33","v":0},{"$f":"BOB!Q33","v":0},{"$f":"C100+D100","v":0},{"$f":"BOB!AI33","v":0},{"$f":"BOB!AH33","v":{"v":0,"d":"0.00"}},{"$f":"CONCATENATE(IF(E100>0,1,IF(G100>0,2,IF(F100>0,3,\"\"))),IF(A100=0,\"žžž\",A100))","v":"žžž"}]
[{"$f":"DEM!B13","v":0},{"$f":"DEM!$B$2","v":"DEM"},{"$f":"DEM!P13","v":0},{"$f":"DEM!Q13","v":0},{"$f":"C101+D101","v":0},{"$f":"DEM!AI13","v":0},{"$f":"DEM!AH13","v":{"v":0,"d":"0.00"}},{"$f":"CONCATENATE(IF(E101>0,1,IF(G101>0,2,IF(F101>0,3,\"\"))),IF(A101=0,\"žžž\",A101))","v":"žžž"}]
[{"$f":"DEM!B14","v":0},{"$f":"DEM!$B$2","v":"DEM"},{"$f":"DEM!P14","v":0},{"$f":"DEM!Q14","v":0},{"$f":"C102+D102","v":0},{"$f":"DEM!AI14","v":0},{"$f":"DEM!AH14","v":{"v":0,"d":"0.00"}},{"$f":"CONCATENATE(IF(E102>0,1,IF(G102>0,2,IF(F102>0,3,\"\"))),IF(A102=0,\"žžž\",A102))","v":"žžž"}]
[{"$f":"DEM!B15","v":0},{"$f":"DEM!$B$2","v":"DEM"},{"$f":"DEM!P15","v":0},{"$f":"DEM!Q15","v":0},{"$f":"C103+D103","v":0},{"$f":"DEM!AI15","v":0},{"$f":"DEM!AH15","v":{"v":0,"d":"0.00"}},{"$f":"CONCATENATE(IF(E103>0,1,IF(G103>0,2,IF(F103>0,3,\"\"))),IF(A103=0,\"žžž\",A103))","v":"žžž"}]
[{"$f":"DEM!B16","v":0},{"$f":"DEM!$B$2","v":"DEM"},{"$f":"DEM!P16","v":0},{"$f":"DEM!Q16","v":0},{"$f":"C104+D104","v":0},{"$f":"DEM!AI16","v":0},{"$f":"DEM!AH16","v":{"v":0,"d":"0.00"}},{"$f":"CONCATENATE(IF(E104>0,1,IF(G104>0,2,IF(F104>0,3,\"\"))),IF(A104=0,\"žžž\",A104))","v":"žžž"}]
[{"$f":"DEM!B17","v":0},{"$f":"DEM!$B$2","v":"DEM"},{"$f":"DEM!P17","v":0},{"$f":"DEM!Q17","v":0},{"$f":"C105+D105","v":0},{"$f":"DEM!AI17","v":0},{"$f":"DEM!AH17","v":{"v":0,"d":"0.00"}},{"$f":"CONCATENATE(IF(E105>0,1,IF(G105>0,2,IF(F105>0,3,\"\"))),IF(A105=0,\"žžž\",A105))","v":"žžž"}]
[{"$f":"DEM!B18","v":0},{"$f":"DEM!$B$2","v":"DEM"},{"$f":"DEM!P18","v":0},{"$f":"DEM!Q18","v":0},{"$f":"C106+D106","v":0},{"$f":"DEM!AI18","v":0},{"$f":"DEM!AH18","v":{"v":0,"d":"0.00"}},{"$f":"CONCATENATE(IF(E106>0,1,IF(G106>0,2,IF(F106>0,3,\"\"))),IF(A106=0,\"žžž\",A106))","v":"žžž"}]
[{"$f":"DEM!B19","v":0},{"$f":"DEM!$B$2","v":"DEM"},{"$f":"DEM!P19","v":0},{"$f":"DEM!Q19","v":0},{"$f":"C107+D107","v":0},{"$f":"DEM!AI19","v":0},{"$f":"DEM!AH19","v":{"v":0,"d":"0.00"}},{"$f":"CONCATENATE(IF(E107>0,1,IF(G107>0,2,IF(F107>0,3,\"\"))),IF(A107=0,\"žžž\",A107))","v":"žžž"}]
[{"$f":"DEM!B20","v":0},{"$f":"DEM!$B$2","v":"DEM"},{"$f":"DEM!P20","v":0},{"$f":"DEM!Q20","v":0},{"$f":"C108+D108","v":0},{"$f":"DEM!AI20","v":0},{"$f":"DEM!AH20","v":{"v":0,"d":"0.00"}},{"$f":"CONCATENATE(IF(E108>0,1,IF(G108>0,2,IF(F108>0,3,\"\"))),IF(A108=0,\"žžž\",A108))","v":"žžž"}]
[{"$f":"DEM!B21","v":0},{"$f":"DEM!$B$2","v":"DEM"},{"$f":"DEM!P21","v":0},{"$f":"DEM!Q21","v":0},{"$f":"C109+D109","v":0},{"$f":"DEM!AI21","v":0},{"$f":"DEM!AH21","v":{"v":0,"d":"0.00"}},{"$f":"CONCATENATE(IF(E109>0,1,IF(G109>0,2,IF(F109>0,3,\"\"))),IF(A109=0,\"žžž\",A109))","v":"žžž"}]
[{"$f":"DEM!B22","v":0},{"$f":"DEM!$B$2","v":"DEM"},{"$f":"DEM!P22","v":0},{"$f":"DEM!Q22","v":0},{"$f":"C110+D110","v":0},{"$f":"DEM!AI22","v":0},{"$f":"DEM!AH22","v":{"v":0,"d":"0.00"}},{"$f":"CONCATENATE(IF(E110>0,1,IF(G110>0,2,IF(F110>0,3,\"\"))),IF(A110=0,\"žžž\",A110))","v":"žžž"}]
[{"$f":"DEM!B23","v":0},{"$f":"DEM!$B$2","v":"DEM"},{"$f":"DEM!P23","v":0},{"$f":"DEM!Q23","v":0},{"$f":"C111+D111","v":0},{"$f":"DEM!AI23","v":0},{"$f":"DEM!AH23","v":{"v":0,"d":"0.00"}},{"$f":"CONCATENATE(IF(E111>0,1,IF(G111>0,2,IF(F111>0,3,\"\"))),IF(A111=0,\"žžž\",A111))","v":"žžž"}]
[{"$f":"DEM!B24","v":0},{"$f":"DEM!$B$2","v":"DEM"},{"$f":"DEM!P24","v":0},{"$f":"DEM!Q24","v":0},{"$f":"C112+D112","v":0},{"$f":"DEM!AI24","v":0},{"$f":"DEM!AH24","v":{"v":0,"d":"0.00"}},{"$f":"CONCATENATE(IF(E112>0,1,IF(G112>0,2,IF(F112>0,3,\"\"))),IF(A112=0,\"žžž\",A112))","v":"žžž"}]
[{"$f":"DEM!B25","v":0},{"$f":"DEM!$B$2","v":"DEM"},{"$f":"DEM!P25","v":0},{"$f":"DEM!Q25","v":0},{"$f":"C113+D113","v":0},{"$f":"DEM!AI25","v":0},{"$f":"DEM!AH25","v":{"v":0,"d":"0.00"}},{"$f":"CONCATENATE(IF(E113>0,1,IF(G113>0,2,IF(F113>0,3,\"\"))),IF(A113=0,\"žžž\",A113))","v":"žžž"}]
[{"$f":"DEM!B26","v":0},{"$f":"DEM!$B$2","v":"DEM"},{"$f":"DEM!P26","v":0},{"$f":"DEM!Q26","v":0},{"$f":"C114+D114","v":0},{"$f":"DEM!AI26","v":0},{"$f":"DEM!AH26","v":{"v":0,"d":"0.00"}},{"$f":"CONCATENATE(IF(E114>0,1,IF(G114>0,2,IF(F114>0,3,\"\"))),IF(A114=0,\"žžž\",A114))","v":"žžž"}]
[{"$f":"DEM!B27","v":0},{"$f":"DEM!$B$2","v":"DEM"},{"$f":"DEM!P27","v":0},{"$f":"DEM!Q27","v":0},{"$f":"C115+D115","v":0},{"$f":"DEM!AI27","v":0},{"$f":"DEM!AH27","v":{"v":0,"d":"0.00"}},{"$f":"CONCATENATE(IF(E115>0,1,IF(G115>0,2,IF(F115>0,3,\"\"))),IF(A115=0,\"žžž\",A115))","v":"žžž"}]
[{"$f":"DEM!B28","v":0},{"$f":"DEM!$B$2","v":"DEM"},{"$f":"DEM!P28","v":0},{"$f":"DEM!Q28","v":0},{"$f":"C116+D116","v":0},{"$f":"DEM!AI28","v":0},{"$f":"DEM!AH28","v":{"v":0,"d":"0.00"}},{"$f":"CONCATENATE(IF(E116>0,1,IF(G116>0,2,IF(F116>0,3,\"\"))),IF(A116=0,\"žžž\",A116))","v":"žžž"}]
[{"$f":"DEM!B29","v":0},{"$f":"DEM!$B$2","v":"DEM"},{"$f":"DEM!P29","v":0},{"$f":"DEM!Q29","v":0},{"$f":"C117+D117","v":0},{"$f":"DEM!AI29","v":0},{"$f":"DEM!AH29","v":{"v":0,"d":"0.00"}},{"$f":"CONCATENATE(IF(E117>0,1,IF(G117>0,2,IF(F117>0,3,\"\"))),IF(A117=0,\"žžž\",A117))","v":"žžž"}]
[{"$f":"DEM!B30","v":0},{"$f":"DEM!$B$2","v":"DEM"},{"$f":"DEM!P30","v":0},{"$f":"DEM!Q30","v":0},{"$f":"C118+D118","v":0},{"$f":"DEM!AI30","v":0},{"$f":"DEM!AH30","v":{"v":0,"d":"0.00"}},{"$f":"CONCATENATE(IF(E118>0,1,IF(G118>0,2,IF(F118>0,3,\"\"))),IF(A118=0,\"žžž\",A118))","v":"žžž"}]
[{"$f":"DEM!B31","v":0},{"$f":"DEM!$B$2","v":"DEM"},{"$f":"DEM!P31","v":0},{"$f":"DEM!Q31","v":0},{"$f":"C119+D119","v":0},{"$f":"DEM!AI31","v":0},{"$f":"DEM!AH31","v":{"v":0,"d":"0.00"}},{"$f":"CONCATENATE(IF(E119>0,1,IF(G119>0,2,IF(F119>0,3,\"\"))),IF(A119=0,\"žžž\",A119))","v":"žžž"}]
[{"$f":"DEM!B32","v":0},{"$f":"DEM!$B$2","v":"DEM"},{"$f":"DEM!P32","v":0},{"$f":"DEM!Q32","v":0},{"$f":"C120+D120","v":0},{"$f":"DEM!AI32","v":0},{"$f":"DEM!AH32","v":{"v":0,"d":"0.00"}},{"$f":"CONCATENATE(IF(E120>0,1,IF(G120>0,2,IF(F120>0,3,\"\"))),IF(A120=0,\"žžž\",A120))","v":"žžž"}]
[{"$f":"DEM!B33","v":0},{"$f":"DEM!$B$2","v":"DEM"},{"$f":"DEM!P33","v":0},{"$f":"DEM!Q33","v":0},{"$f":"C121+D121","v":0},{"$f":"DEM!AI33","v":0},{"$f":"DEM!AH33","v":{"v":0,"d":"0.00"}},{"$f":"CONCATENATE(IF(E121>0,1,IF(G121>0,2,IF(F121>0,3,\"\"))),IF(A121=0,\"žžž\",A121))","v":"žžž"}]
[{"$f":"DEM!B17","v":0},{"$f":"DEM!$B$2","v":"DEM"},{"$f":"DEM!P17","v":0},{"$f":"DEM!Q17","v":0},{"$f":"C122+D122","v":0},{"$f":"DEM!AI17","v":0},{"$f":"DEM!AH17","v":{"v":0,"d":"0.00"}},{"$f":"CONCATENATE(IF(E122>0,1,IF(G122>0,2,IF(F122>0,3,\"\"))),IF(A122=0,\"žžž\",A122))","v":"žžž"}]
[{"$f":"DEM!B18","v":0},{"$f":"DEM!$B$2","v":"DEM"},{"$f":"DEM!P18","v":0},{"$f":"DEM!Q18","v":0},{"$f":"C123+D123","v":0},{"$f":"DEM!AI18","v":0},{"$f":"DEM!AH18","v":{"v":0,"d":"0.00"}},{"$f":"CONCATENATE(IF(E123>0,1,IF(G123>0,2,IF(F123>0,3,\"\"))),IF(A123=0,\"žžž\",A123))","v":"žžž"}]
[{"$f":"DEM!B19","v":0},{"$f":"DEM!$B$2","v":"DEM"},{"$f":"DEM!P19","v":0},{"$f":"DEM!Q19","v":0},{"$f":"C124+D124","v":0},{"$f":"DEM!AI19","v":0},{"$f":"DEM!AH19","v":{"v":0,"d":"0.00"}},{"$f":"CONCATENATE(IF(E124>0,1,IF(G124>0,2,IF(F124>0,3,\"\"))),IF(A124=0,\"žžž\",A124))","v":"žžž"}]
[{"$f":"DEM!B20","v":0},{"$f":"DEM!$B$2","v":"DEM"},{"$f":"DEM!P20","v":0},{"$f":"DEM!Q20","v":0},{"$f":"C125+D125","v":0},{"$f":"DEM!AI20","v":0},{"$f":"DEM!AH20","v":{"v":0,"d":"0.00"}},{"$f":"CONCATENATE(IF(E125>0,1,IF(G125>0,2,IF(F125>0,3,\"\"))),IF(A125=0,\"žžž\",A125))","v":"žžž"}]
[{"$f":"DEM!B21","v":0},{"$f":"DEM!$B$2","v":"DEM"},{"$f":"DEM!P21","v":0},{"$f":"DEM!Q21","v":0},{"$f":"C126+D126","v":0},{"$f":"DEM!AI21","v":0},{"$f":"DEM!AH21","v":{"v":0,"d":"0.00"}},{"$f":"CONCATENATE(IF(E126>0,1,IF(G126>0,2,IF(F126>0,3,\"\"))),IF(A126=0,\"žžž\",A126))","v":"žžž"}]
[{"$f":"DEM!B22","v":0},{"$f":"DEM!$B$2","v":"DEM"},{"$f":"DEM!P22","v":0},{"$f":"DEM!Q22","v":0},{"$f":"C127+D127","v":0},{"$f":"DEM!AI22","v":0},{"$f":"DEM!AH22","v":{"v":0,"d":"0.00"}},{"$f":"CONCATENATE(IF(E127>0,1,IF(G127>0,2,IF(F127>0,3,\"\"))),IF(A127=0,\"žžž\",A127))","v":"žžž"}]
[{"$f":"DEM!B23","v":0},{"$f":"DEM!$B$2","v":"DEM"},{"$f":"DEM!P23","v":0},{"$f":"DEM!Q23","v":0},{"$f":"C128+D128","v":0},{"$f":"DEM!AI23","v":0},{"$f":"DEM!AH23","v":{"v":0,"d":"0.00"}},{"$f":"CONCATENATE(IF(E128>0,1,IF(G128>0,2,IF(F128>0,3,\"\"))),IF(A128=0,\"žžž\",A128))","v":"žžž"}]
[{"$f":"DEM!B24","v":0},{"$f":"DEM!$B$2","v":"DEM"},{"$f":"DEM!P24","v":0},{"$f":"DEM!Q24","v":0},{"$f":"C129+D129","v":0},{"$f":"DEM!AI24","v":0},{"$f":"DEM!AH24","v":{"v":0,"d":"0.00"}},{"$f":"CONCATENATE(IF(E129>0,1,IF(G129>0,2,IF(F129>0,3,\"\"))),IF(A129=0,\"žžž\",A129))","v":"žžž"}]
[{"$f":"DEM!B25","v":0},{"$f":"DEM!$B$2","v":"DEM"},{"$f":"DEM!P25","v":0},{"$f":"DEM!Q25","v":0},{"$f":"C130+D130","v":0},{"$f":"DEM!AI25","v":0},{"$f":"DEM!AH25","v":{"v":0,"d":"0.00"}},{"$f":"CONCATENATE(IF(E130>0,1,IF(G130>0,2,IF(F130>0,3,\"\"))),IF(A130=0,\"žžž\",A130))","v":"žžž"}]
[{"$f":"DEM!B26","v":0},{"$f":"DEM!$B$2","v":"DEM"},{"$f":"DEM!P26","v":0},{"$f":"DEM!Q26","v":0},{"$f":"C131+D131","v":0},{"$f":"DEM!AI26","v":0},{"$f":"DEM!AH26","v":{"v":0,"d":"0.00"}},{"$f":"CONCATENATE(IF(E131>0,1,IF(G131>0,2,IF(F131>0,3,\"\"))),IF(A131=0,\"žžž\",A131))","v":"žžž"}]
[{"$f":"DEM!B27","v":0},{"$f":"DEM!$B$2","v":"DEM"},{"$f":"DEM!P27","v":0},{"$f":"DEM!Q27","v":0},{"$f":"C132+D132","v":0},{"$f":"DEM!AI27","v":0},{"$f":"DEM!AH27","v":{"v":0,"d":"0.00"}},{"$f":"CONCATENATE(IF(E132>0,1,IF(G132>0,2,IF(F132>0,3,\"\"))),IF(A132=0,\"žžž\",A132))","v":"žžž"}]
[{"$f":"DEM!B28","v":0},{"$f":"DEM!$B$2","v":"DEM"},{"$f":"DEM!P28","v":0},{"$f":"DEM!Q28","v":0},{"$f":"C133+D133","v":0},{"$f":"DEM!AI28","v":0},{"$f":"DEM!AH28","v":{"v":0,"d":"0.00"}},{"$f":"CONCATENATE(IF(E133>0,1,IF(G133>0,2,IF(F133>0,3,\"\"))),IF(A133=0,\"žžž\",A133))","v":"žžž"}]
[{"$f":"DEM!B29","v":0},{"$f":"DEM!$B$2","v":"DEM"},{"$f":"DEM!P29","v":0},{"$f":"DEM!Q29","v":0},{"$f":"C134+D134","v":0},{"$f":"DEM!AI29","v":0},{"$f":"DEM!AH29","v":{"v":0,"d":"0.00"}},{"$f":"CONCATENATE(IF(E134>0,1,IF(G134>0,2,IF(F134>0,3,\"\"))),IF(A134=0,\"žžž\",A134))","v":"žžž"}]
[{"$f":"DEM!B30","v":0},{"$f":"DEM!$B$2","v":"DEM"},{"$f":"DEM!P30","v":0},{"$f":"DEM!Q30","v":0},{"$f":"C135+D135","v":0},{"$f":"DEM!AI30","v":0},{"$f":"DEM!AH30","v":{"v":0,"d":"0.00"}},{"$f":"CONCATENATE(IF(E135>0,1,IF(G135>0,2,IF(F135>0,3,\"\"))),IF(A135=0,\"žžž\",A135))","v":"žžž"}]
[{"$f":"DEM!B31","v":0},{"$f":"DEM!$B$2","v":"DEM"},{"$f":"DEM!P31","v":0},{"$f":"DEM!Q31","v":0},{"$f":"C136+D136","v":0},{"$f":"DEM!AI31","v":0},{"$f":"DEM!AH31","v":{"v":0,"d":"0.00"}},{"$f":"CONCATENATE(IF(E136>0,1,IF(G136>0,2,IF(F136>0,3,\"\"))),IF(A136=0,\"žžž\",A136))","v":"žžž"}]
[{"$f":"DEM!B32","v":0},{"$f":"DEM!$B$2","v":"DEM"},{"$f":"DEM!P32","v":0},{"$f":"DEM!Q32","v":0},{"$f":"C137+D137","v":0},{"$f":"DEM!AI32","v":0},{"$f":"DEM!AH32","v":{"v":0,"d":"0.00"}},{"$f":"CONCATENATE(IF(E137>0,1,IF(G137>0,2,IF(F137>0,3,\"\"))),IF(A137=0,\"žžž\",A137))","v":"žžž"}]
[{"$f":"DEM!B33","v":0},{"$f":"DEM!$B$2","v":"DEM"},{"$f":"DEM!P33","v":0},{"$f":"DEM!Q33","v":0},{"$f":"C138+D138","v":0},{"$f":"DEM!AI33","v":0},{"$f":"DEM!AH33","v":{"v":0,"d":"0.00"}},{"$f":"CONCATENATE(IF(E138>0,1,IF(G138>0,2,IF(F138>0,3,\"\"))),IF(A138=0,\"žžž\",A138))","v":"žžž"}]
[{"$f":"'T5'!B21","v":0},{"$f":"'T5'!$B$2","v":"T5"},{"$f":"'T5'!P21","v":0},{"$f":"'T5'!Q21","v":0},{"$f":"C139+D139","v":0},{"$f":"'T5'!AI21","v":0},{"$f":"'T5'!AH21","v":{"v":0,"d":"0.00"}},{"$f":"CONCATENATE(IF(E139>0,1,IF(G139>0,2,IF(F139>0,3,\"\"))),IF(A139=0,\"žžž\",A139))","v":"žžž"}]
[{"$f":"'T5'!B22","v":0},{"$f":"'T5'!$B$2","v":"T5"},{"$f":"'T5'!P22","v":0},{"$f":"'T5'!Q22","v":0},{"$f":"C140+D140","v":0},{"$f":"'T5'!AI22","v":0},{"$f":"'T5'!AH22","v":{"v":0,"d":"0.00"}},{"$f":"CONCATENATE(IF(E140>0,1,IF(G140>0,2,IF(F140>0,3,\"\"))),IF(A140=0,\"žžž\",A140))","v":"žžž"}]
[{"$f":"'T5'!B23","v":0},{"$f":"'T5'!$B$2","v":"T5"},{"$f":"'T5'!P23","v":0},{"$f":"'T5'!Q23","v":0},{"$f":"C141+D141","v":0},{"$f":"'T5'!AI23","v":0},{"$f":"'T5'!AH23","v":{"v":0,"d":"0.00"}},{"$f":"CONCATENATE(IF(E141>0,1,IF(G141>0,2,IF(F141>0,3,\"\"))),IF(A141=0,\"žžž\",A141))","v":"žžž"}]
[{"$f":"'T5'!B24","v":0},{"$f":"'T5'!$B$2","v":"T5"},{"$f":"'T5'!P24","v":0},{"$f":"'T5'!Q24","v":0},{"$f":"C142+D142","v":0},{"$f":"'T5'!AI24","v":0},{"$f":"'T5'!AH24","v":{"v":0,"d":"0.00"}},{"$f":"CONCATENATE(IF(E142>0,1,IF(G142>0,2,IF(F142>0,3,\"\"))),IF(A142=0,\"žžž\",A142))","v":"žžž"}]
[{"$f":"'T5'!B25","v":0},{"$f":"'T5'!$B$2","v":"T5"},{"$f":"'T5'!P25","v":0},{"$f":"'T5'!Q25","v":0},{"$f":"C143+D143","v":0},{"$f":"'T5'!AI25","v":0},{"$f":"'T5'!AH25","v":{"v":0,"d":"0.00"}},{"$f":"CONCATENATE(IF(E143>0,1,IF(G143>0,2,IF(F143>0,3,\"\"))),IF(A143=0,\"žžž\",A143))","v":"žžž"}]
[{"$f":"'T5'!B26","v":0},{"$f":"'T5'!$B$2","v":"T5"},{"$f":"'T5'!P26","v":0},{"$f":"'T5'!Q26","v":0},{"$f":"C144+D144","v":0},{"$f":"'T5'!AI26","v":0},{"$f":"'T5'!AH26","v":{"v":0,"d":"0.00"}},{"$f":"CONCATENATE(IF(E144>0,1,IF(G144>0,2,IF(F144>0,3,\"\"))),IF(A144=0,\"žžž\",A144))","v":"žžž"}]
[{"$f":"'T5'!B27","v":0},{"$f":"'T5'!$B$2","v":"T5"},{"$f":"'T5'!P27","v":0},{"$f":"'T5'!Q27","v":0},{"$f":"C145+D145","v":0},{"$f":"'T5'!AI27","v":0},{"$f":"'T5'!AH27","v":{"v":0,"d":"0.00"}},{"$f":"CONCATENATE(IF(E145>0,1,IF(G145>0,2,IF(F145>0,3,\"\"))),IF(A145=0,\"žžž\",A145))","v":"žžž"}]
[{"$f":"'T5'!B28","v":0},{"$f":"'T5'!$B$2","v":"T5"},{"$f":"'T5'!P28","v":0},{"$f":"'T5'!Q28","v":0},{"$f":"C146+D146","v":0},{"$f":"'T5'!AI28","v":0},{"$f":"'T5'!AH28","v":{"v":0,"d":"0.00"}},{"$f":"CONCATENATE(IF(E146>0,1,IF(G146>0,2,IF(F146>0,3,\"\"))),IF(A146=0,\"žžž\",A146))","v":"žžž"}]
[{"$f":"'T5'!B29","v":0},{"$f":"'T5'!$B$2","v":"T5"},{"$f":"'T5'!P29","v":0},{"$f":"'T5'!Q29","v":0},{"$f":"C147+D147","v":0},{"$f":"'T5'!AI29","v":0},{"$f":"'T5'!AH29","v":{"v":0,"d":"0.00"}},{"$f":"CONCATENATE(IF(E147>0,1,IF(G147>0,2,IF(F147>0,3,\"\"))),IF(A147=0,\"žžž\",A147))","v":"žžž"}]
[{"$f":"'T5'!B30","v":0},{"$f":"'T5'!$B$2","v":"T5"},{"$f":"'T5'!P30","v":0},{"$f":"'T5'!Q30","v":0},{"$f":"C148+D148","v":0},{"$f":"'T5'!AI30","v":0},{"$f":"'T5'!AH30","v":{"v":0,"d":"0.00"}},{"$f":"CONCATENATE(IF(E148>0,1,IF(G148>0,2,IF(F148>0,3,\"\"))),IF(A148=0,\"žžž\",A148))","v":"žžž"}]
[{"$f":"'T5'!B31","v":0},{"$f":"'T5'!$B$2","v":"T5"},{"$f":"'T5'!P31","v":0},{"$f":"'T5'!Q31","v":0},{"$f":"C149+D149","v":0},{"$f":"'T5'!AI31","v":0},{"$f":"'T5'!AH31","v":{"v":0,"d":"0.00"}},{"$f":"CONCATENATE(IF(E149>0,1,IF(G149>0,2,IF(F149>0,3,\"\"))),IF(A149=0,\"žžž\",A149))","v":"žžž"}]
[{"$f":"'T5'!B32","v":0},{"$f":"'T5'!$B$2","v":"T5"},{"$f":"'T5'!P32","v":0},{"$f":"'T5'!Q32","v":0},{"$f":"C150+D150","v":0},{"$f":"'T5'!AI32","v":0},{"$f":"'T5'!AH32","v":{"v":0,"d":"0.00"}},{"$f":"CONCATENATE(IF(E150>0,1,IF(G150>0,2,IF(F150>0,3,\"\"))),IF(A150=0,\"žžž\",A150))","v":"žžž"}]
[{"$f":"'T5'!B33","v":0},{"$f":"'T5'!$B$2","v":"T5"},{"$f":"'T5'!P33","v":0},{"$f":"'T5'!Q33","v":0},{"$f":"C151+D151","v":0},{"$f":"'T5'!AI33","v":0},{"$f":"'T5'!AH33","v":{"v":0,"d":"0.00"}},{"$f":"CONCATENATE(IF(E151>0,1,IF(G151>0,2,IF(F151>0,3,\"\"))),IF(A151=0,\"žžž\",A151))","v":"žžž"}]
[{"$f":"DEM!B33","v":0},{"$f":"DEM!$B$2","v":"DEM"},{"$f":"DEM!P33","v":0},{"$f":"DEM!Q33","v":0},{"$f":"C152+D152","v":0},{"$f":"DEM!AJ33","v":0},{"$f":"DEM!AM33","v":{"v":0,"d":"0.00"}}]
[{"$f":"DEM!B21","v":0},{"$f":"DEM!$B$2","v":"DEM"},{"$f":"DEM!AH21","v":0},{"$f":"DEM!AI21","v":0},{"$f":"C153+D153","v":0},{"$f":"DEM!AJ21","v":0},{"$f":"DEM!AM21","v":{"v":0,"d":"0.00"}}]
[{"$f":"DEM!B22","v":0},{"$f":"DEM!$B$2","v":"DEM"},{"$f":"DEM!AH22","v":0},{"$f":"DEM!AI22","v":0},{"$f":"C154+D154","v":0},{"$f":"DEM!AJ22","v":0},{"$f":"DEM!AM22","v":{"v":0,"d":"0.00"}}]
[{"$f":"DEM!B23","v":0},{"$f":"DEM!$B$2","v":"DEM"},{"$f":"DEM!AH23","v":0},{"$f":"DEM!AI23","v":0},{"$f":"C155+D155","v":0},{"$f":"DEM!AJ23","v":0},{"$f":"DEM!AM23","v":{"v":0,"d":"0.00"}}]
[{"$f":"DEM!B24","v":0},{"$f":"DEM!$B$2","v":"DEM"},{"$f":"DEM!AH24","v":0},{"$f":"DEM!AI24","v":0},{"$f":"C156+D156","v":0},{"$f":"DEM!AJ24","v":0},{"$f":"DEM!AM24","v":{"v":0,"d":"0.00"}}]
[{"$f":"DEM!B25","v":0},{"$f":"DEM!$B$2","v":"DEM"},{"$f":"DEM!AH25","v":0},{"$f":"DEM!AI25","v":0},{"$f":"C157+D157","v":0},{"$f":"DEM!AJ25","v":0},{"$f":"DEM!AM25","v":{"v":0,"d":"0.00"}}]
[{"$f":"DEM!B26","v":0},{"$f":"DEM!$B$2","v":"DEM"},{"$f":"DEM!AH26","v":0},{"$f":"DEM!AI26","v":0},{"$f":"C158+D158","v":0},{"$f":"DEM!AJ26","v":0},{"$f":"DEM!AM26","v":{"v":0,"d":"0.00"}}]
[{"$f":"DEM!B27","v":0},{"$f":"DEM!$B$2","v":"DEM"},{"$f":"DEM!AH27","v":0},{"$f":"DEM!AI27","v":0},{"$f":"C159+D159","v":0},{"$f":"DEM!AJ27","v":0},{"$f":"DEM!AM27","v":{"v":0,"d":"0.00"}}]
[{"$f":"DEM!B28","v":0},{"$f":"DEM!$B$2","v":"DEM"},{"$f":"DEM!AH28","v":0},{"$f":"DEM!AI28","v":0},{"$f":"C160+D160","v":0},{"$f":"DEM!AJ28","v":0},{"$f":"DEM!AM28","v":{"v":0,"d":"0.00"}}]
[{"$f":"DEM!B29","v":0},{"$f":"DEM!$B$2","v":"DEM"},{"$f":"DEM!AH29","v":0},{"$f":"DEM!AI29","v":0},{"$f":"C161+D161","v":0},{"$f":"DEM!AJ29","v":0},{"$f":"DEM!AM29","v":{"v":0,"d":"0.00"}}]
[{"$f":"DEM!B30","v":0},{"$f":"DEM!$B$2","v":"DEM"},{"$f":"DEM!AH30","v":0},{"$f":"DEM!AI30","v":0},{"$f":"C162+D162","v":0},{"$f":"DEM!AJ30","v":0},{"$f":"DEM!AM30","v":{"v":0,"d":"0.00"}}]
[{"$f":"DEM!B31","v":0},{"$f":"DEM!$B$2","v":"DEM"},{"$f":"DEM!AH31","v":0},{"$f":"DEM!AI31","v":0},{"$f":"C163+D163","v":0},{"$f":"DEM!AJ31","v":0},{"$f":"DEM!AM31","v":{"v":0,"d":"0.00"}}]
[{"$f":"DEM!B32","v":0},{"$f":"DEM!$B$2","v":"DEM"},{"$f":"DEM!AH32","v":0},{"$f":"DEM!AI32","v":0},{"$f":"C164+D164","v":0},{"$f":"DEM!AJ32","v":0},{"$f":"DEM!AM32","v":{"v":0,"d":"0.00"}}]
[{"$f":"DEM!B33","v":0},{"$f":"DEM!$B$2","v":"DEM"},{"$f":"DEM!AH33","v":0},{"$f":"DEM!AI33","v":0},{"$f":"C165+D165","v":0},{"$f":"DEM!AJ33","v":0},{"$f":"DEM!AM33","v":{"v":0,"d":"0.00"}}]
[{"$f":"BOB!B18","v":0},{"$f":"BOB!$B$2","v":"BOB"},{"$f":"BOB!AH18","v":0},{"$f":"BOB!AI18","v":0},{"$f":"C166+D166","v":0},{"$f":"BOB!AJ18","v":0},{"$f":"BOB!AM18","v":{"v":0,"d":"0.00"}}]
[{"$f":"BOB!B19","v":0},{"$f":"BOB!$B$2","v":"BOB"},{"$f":"BOB!AH19","v":0},{"$f":"BOB!AI19","v":0},{"$f":"C167+D167","v":0},{"$f":"BOB!AJ19","v":0},{"$f":"BOB!AM19","v":{"v":0,"d":"0.00"}}]
[{"$f":"BOB!B20","v":0},{"$f":"BOB!$B$2","v":"BOB"},{"$f":"BOB!AH20","v":0},{"$f":"BOB!AI20","v":0},{"$f":"C168+D168","v":0},{"$f":"BOB!AJ20","v":0},{"$f":"BOB!AM20","v":{"v":0,"d":"0.00"}}]
[{"$f":"BOB!B21","v":0},{"$f":"BOB!$B$2","v":"BOB"},{"$f":"BOB!AH21","v":0},{"$f":"BOB!AI21","v":0},{"$f":"C169+D169","v":0},{"$f":"BOB!AJ21","v":0},{"$f":"BOB!AM21","v":{"v":0,"d":"0.00"}}]
[{"$f":"BOB!B22","v":0},{"$f":"BOB!$B$2","v":"BOB"},{"$f":"BOB!AH22","v":0},{"$f":"BOB!AI22","v":0},{"$f":"C170+D170","v":0},{"$f":"BOB!AJ22","v":0},{"$f":"BOB!AM22","v":{"v":0,"d":"0.00"}}]
[{"$f":"BOB!B23","v":0},{"$f":"BOB!$B$2","v":"BOB"},{"$f":"BOB!AH23","v":0},{"$f":"BOB!AI23","v":0},{"$f":"C171+D171","v":0},{"$f":"BOB!AJ23","v":0},{"$f":"BOB!AM23","v":{"v":0,"d":"0.00"}}]
[{"$f":"BOB!B24","v":0},{"$f":"BOB!$B$2","v":"BOB"},{"$f":"BOB!AH24","v":0},{"$f":"BOB!AI24","v":0},{"$f":"C172+D172","v":0},{"$f":"BOB!AJ24","v":0},{"$f":"BOB!AM24","v":{"v":0,"d":"0.00"}}]
[{"$f":"BOB!B25","v":0},{"$f":"BOB!$B$2","v":"BOB"},{"$f":"BOB!AH25","v":0},{"$f":"BOB!AI25","v":0},{"$f":"C173+D173","v":0},{"$f":"BOB!AJ25","v":0},{"$f":"BOB!AM25","v":{"v":0,"d":"0.00"}}]
[{"$f":"BOB!B26","v":0},{"$f":"BOB!$B$2","v":"BOB"},{"$f":"BOB!AH26","v":0},{"$f":"BOB!AI26","v":0},{"$f":"C174+D174","v":0},{"$f":"BOB!AJ26","v":0},{"$f":"BOB!AM26","v":{"v":0,"d":"0.00"}}]
[{"$f":"BOB!B27","v":0},{"$f":"BOB!$B$2","v":"BOB"},{"$f":"BOB!AH27","v":0},{"$f":"BOB!AI27","v":0},{"$f":"C175+D175","v":0},{"$f":"BOB!AJ27","v":0},{"$f":"BOB!AM27","v":{"v":0,"d":"0.00"}}]
[{"$f":"BOB!B28","v":0},{"$f":"BOB!$B$2","v":"BOB"},{"$f":"BOB!AH28","v":0},{"$f":"BOB!AI28","v":0},{"$f":"C176+D176","v":0},{"$f":"BOB!AJ28","v":0},{"$f":"BOB!AM28","v":{"v":0,"d":"0.00"}}]
[{"$f":"BOB!B29","v":0},{"$f":"BOB!$B$2","v":"BOB"},{"$f":"BOB!AH29","v":0},{"$f":"BOB!AI29","v":0},{"$f":"C177+D177","v":0},{"$f":"BOB!AJ29","v":0},{"$f":"BOB!AM29","v":{"v":0,"d":"0.00"}}]
[{"$f":"BOB!B30","v":0},{"$f":"BOB!$B$2","v":"BOB"},{"$f":"BOB!AH30","v":0},{"$f":"BOB!AI30","v":0},{"$f":"C178+D178","v":0},{"$f":"BOB!AJ30","v":0},{"$f":"BOB!AM30","v":{"v":0,"d":"0.00"}}]
[{"$f":"BOB!B31","v":0},{"$f":"BOB!$B$2","v":"BOB"},{"$f":"BOB!AH31","v":0},{"$f":"BOB!AI31","v":0},{"$f":"C179+D179","v":0},{"$f":"BOB!AJ31","v":0},{"$f":"BOB!AM31","v":{"v":0,"d":"0.00"}}]
[{"$f":"BOB!B32","v":0},{"$f":"BOB!$B$2","v":"BOB"},{"$f":"BOB!AH32","v":0},{"$f":"BOB!AI32","v":0},{"$f":"C180+D180","v":0},{"$f":"BOB!AJ32","v":0},{"$f":"BOB!AM32","v":{"v":0,"d":"0.00"}}]
[{"$f":"BOB!B33","v":0},{"$f":"BOB!$B$2","v":"BOB"},{"$f":"BOB!AH33","v":0},{"$f":"BOB!AI33","v":0},{"$f":"C181+D181","v":0},{"$f":"BOB!AJ33","v":0},{"$f":"BOB!AM33","v":{"v":0,"d":"0.00"}}]

{"sheet":"BCI","index":6,"n_rows":33,"n_cols":37,"rows_kept":33}
["název","Bobříci","Bodovani","Z1",null,"Z2",null,"Z3",null,"Z4",null,"Z5",null,"Z6",null,"CEL",null,null,"Brankaři","Z1",null,"Z2",null,"Z3",null,"Z4",null,"Z5",null,"Z6",null,"CEL",null,null,"Tresty"]
["kód","BCI",null,"G","N","G","N","G","N","G","N","G","N","G","N","G","N","K",null,"Z","G","Z","G","Z","G","Z","G","Z","G","Z","G","Z","G","%","min celk."]
["info","Hráči","#"]
[null,"Josef Byška",{"$nulls":13},{"$f":"D4+F4+H4+J4+L4+N4","v":0},{"$f":"E4+G4+I4+K4+M4+O4","v":0},{"$f":"P4+Q4","v":0},{"$f":"IF(A4=\"B\",\"X\",\"\")","v":""},{"$nulls":12},{"$f":"T4+V4+X4+Z4+AB4+AD4","v":0},{"$f":"U4+W4+Y4+AA4+AC4+AE4","v":0},{"$f":"IF(AF4+AG4 < 1,0,AF4*100/(AF4+AG4))","v":{"v":0,"d":"0.00"}}]
[null,"Marco Bubela *",12,2,0,null,null,11,{"$nulls":7},{"$f":"D5+F5+H5+J5+L5+N5","v":13},{"$f":"E5+G5+I5+K5+M5+O5","v":0},{"$f":"P5+Q5","v":13},{"$f":"IF(A5=\"B\",\"X\",\"\")","v":""},{"$nulls":12},{"$f":"T5+V5+X5+Z5+AB5+AD5","v":0},{"$f":"U5+W5+Y5+AA5+AC5+AE5","v":0},{"$f":"IF(AF5+AG5 < 1,0,AF5*100/(AF5+AG5))","v":{"v":0,"d":"0.00"}},2]
[null,"Lada Procházková *",8,{"$nulls":12},0,0,0,"",{"$nulls":12},0,0,{"v":0,"d":"0.00"},2]
[null,"Vojtěch Kulič *",13,{"$nulls":12},0,0,0,"x",null,null,9,19,{"$nulls":8},9,19,{"v":32.142857142857146,"d":"32.14"},null,null,"Jiří Bidlo 5,"]
[null,"Vlášek Matěj",14,null,null,1,{"$nulls":9},1,0,1,"",{"$nulls":12},0,0,{"v":0,"d":"0.00"},null,null,"Vít Bidlo 22,"]
[null,"Jakub Vlášek *",1,{"$nulls":4},1,2,{"$nulls":6},1,2,3,"",{"$nulls":12},0,0,{"v":0,"d":"0.00"},null,null,"David Farský 3,"]
[null,"Josef Škoda",3,{"$nulls":5},1,{"$nulls":6},0,1,1,{"$nulls":13},0,0,{"v":0,"d":"0.00"},null,null,"Martin Kareš 5,"]
[null,"Emil Hejda BOB",{"$nulls":13},0,0,0,"x",16,17,{"$nulls":10},16,17,{"v":48.484848484848484,"d":"48.48"},null,null,"Maxim Klouček 2,"]
[null,"Vojtěch Procházka BOB",{"$nulls":13},0,0,0,"",{"$nulls":4},14,1,{"$nulls":6},14,1,{"v":93.33333333333333,"d":"93.33"},null,null,"Samuel Mesany 8,"]
[{"$nulls":15},0,0,0,"",{"$nulls":12},0,0,{"v":0,"d":"0.00"},null,null,"Jan Procházka 10,"]
[{"$nulls":15},0,0,0,"",{"$nulls":12},0,0,{"v":0,"d":"0.00"},null,null,"Jakub Rilják 7,"]
[{"$nulls":15},0,0,0,"",{"$nulls":12},0,0,{"v":0,"d":"0.00"},null,null,"Ondřej Staněk 13,"]
[{"$nulls":15},0,0,0,"",{"$nulls":12},0,0,{"v":0,"d":"0.00"},null,null,"Jan Tůma B"]
[{"$nulls":15},0,0,0,"",{"$nulls":12},0,0,{"v":0,"d":"0.00"}]
[{"$nulls":15},0,0,0,"",{"$nulls":12},0,0,{"v":0,"d":"0.00"}]
[{"$nulls":15},0,0,0,"",{"$nulls":12},0,0,{"v":0,"d":"0.00"}]
[{"$nulls":15},0,0,0,"",{"$nulls":12},0,0,{"v":0,"d":"0.00"}]
[{"$nulls":15},0,0,0,"",{"$nulls":12},0,0,{"v":0,"d":"0.00"}]
[{"$nulls":15},0,0,0,"",{"$nulls":12},0,0,{"v":0,"d":"0.00"}]
[{"$nulls":15},0,0,0,"",{"$nulls":12},0,0,{"v":0,"d":"0.00"}]
[{"$nulls":15},0,0,0,"",{"$nulls":12},0,0,{"v":0,"d":"0.00"}]
[{"$nulls":15},0,0,0,"",{"$nulls":12},0,0,{"v":0,"d":"0.00"}]
[{"$nulls":15},0,0,0,"",{"$nulls":12},0,0,{"v":0,"d":"0.00"}]
[{"$nulls":15},0,0,0,"",{"$nulls":12},0,0,{"v":0,"d":"0.00"}]
[{"$nulls":15},0,0,0,"",{"$nulls":12},0,0,{"v":0,"d":"0.00"}]
[{"$nulls":15},0,0,0,"",{"$nulls":12},0,0,{"v":0,"d":"0.00"}]
[{"$nulls":15},0,0,0,"",{"$nulls":12},0,0,{"v":0,"d":"0.00"}]
[{"$nulls":15},0,0,0,"",{"$nulls":12},0,0,{"v":0,"d":"0.00"}]
[{"$nulls":15},0,0,0,"",{"$nulls":12},0,0,{"v":0,"d":"0.00"}]
[{"$nulls":15},0,0,0,"",{"$nulls":12},0,0,{"v":0,"d":"0.00"}]

{"sheet":"LOW","index":7,"n_rows":33,"n_cols":35,"rows_kept":33}
["název","Lowlander Zábřeh","Bodovani","Z1",null,"Z2",null,"Z3",null,"Z4",null,"Z5",null,"Z6",null,"CEL",null,null,"Brankaři","Z1",null,"Z2",null,"Z3",null,"Z4",null,"Z5",null,"Z6",null,"CEL",null,null,"Tresty"]
["kód","LOW",null,"G","N","G","N","G","N","G","N","G","N","G","N","G","N","K",null,"Z","G","Z","G","Z","G","Z","G","Z","G","Z","G","Z","G","%","min celk."]
["info","Hráči","#"]
[null,"Lubojacký Robert",3,null,null,1,2,null,1,{"$nulls":6},{"$f":"D4+F4+H4+J4+L4+N4","v":1},{"$f":"E4+G4+I4+K4+M4+O4","v":3},{"$f":"P4+Q4","v":4},"x",9,2,{"$nulls":10},{"$f":"T4+V4+X4+Z4+AB4+AD4","v":9},{"$f":"U4+W4+Y4+AA4+AC4+AE4","v":2},{"$f":"IF(AF4+AG4 < 1,0,AF4*100/(AF4+AG4))","v":{"v":81.81818181818181,"d":"81.82"}}]
[null,"Jakub Holinka",4,6,1,null,null,10,{"$nulls":7},{"$f":"D5+F5+H5+J5+L5+N5","v":16},{"$f":"E5+G5+I5+K5+M5+O5","v":1},{"$f":"P5+Q5","v":17},"x",null,null,10,0,{"$nulls":8},{"$f":"T5+V5+X5+Z5+AB5+AD5","v":10},0,{"$f":"IF(AF5+AG5 < 1,0,AF5*100/(AF5+AG5))","v":{"v":100,"d":"100.00"}}]
[null,"Hynek Matura",9,3,3,7,3,1,{"$nulls":7},11,6,17,{"$f":"IF(A6=\"B\",\"X\",\"\")","v":""},{"$nulls":12},0,0,{"v":0,"d":"0.00"}]
[null,"Václavek Filip",10,5,null,4,2,{"$nulls":8},9,2,11,"",{"$nulls":4},13,12,{"$nulls":6},13,12,{"v":52,"d":"52.00"}]
[null,"Jáchym Čech",13,1,5,3,3,null,4,{"$nulls":6},4,12,16,"",{"$nulls":12},0,0,{"v":0,"d":"0.00"}]
[null,"Lant Vít",8,2,null,7,null,null,1,{"$nulls":6},9,1,10,"",{"$nulls":12},0,0,{"v":0,"d":"0.00"}]
[null,"Lexman Martin *",26,null,3,null,2,{"$nulls":8},0,5,5,"",{"$nulls":12},0,0,{"v":0,"d":"0.00"}]
[null,"Lexman Jakub *",5,{"$nulls":3},1,{"$nulls":8},0,1,1,"",{"$nulls":12},0,0,{"v":0,"d":"0.00"}]
[null,"Dittrich Jakub",32,{"$nulls":12},0,0,0,"",{"$nulls":12},0,0,{"v":0,"d":"0.00"}]
[{"$nulls":15},0,0,0,"",{"$nulls":12},0,0,{"v":0,"d":"0.00"}]
[{"$nulls":15},0,0,0,"",{"$nulls":12},0,0,{"v":0,"d":"0.00"}]
[{"$nulls":15},0,0,0,"",{"$nulls":12},0,0,{"v":0,"d":"0.00"}]
[{"$nulls":15},0,0,0,"",{"$nulls":12},0,0,{"v":0,"d":"0.00"}]
[{"$nulls":15},0,0,0,"",{"$nulls":12},0,0,{"v":0,"d":"0.00"}]
[{"$nulls":15},0,0,0,"",{"$nulls":12},0,0,{"v":0,"d":"0.00"}]
[{"$nulls":15},0,0,0,"",{"$nulls":12},0,0,{"v":0,"d":"0.00"}]
[{"$nulls":15},0,0,0,"",{"$nulls":12},0,0,{"v":0,"d":"0.00"}]
[{"$nulls":15},0,0,0,"",{"$nulls":12},0,0,{"v":0,"d":"0.00"}]
[{"$nulls":15},0,0,0,"",{"$nulls":12},0,0,{"v":0,"d":"0.00"}]
[{"$nulls":15},0,0,0,"",{"$nulls":12},0,0,{"v":0,"d":"0.00"}]
[{"$nulls":15},0,0,0,"",{"$nulls":12},0,0,{"v":0,"d":"0.00"}]
[{"$nulls":15},0,0,0,"",{"$nulls":12},0,0,{"v":0,"d":"0.00"}]
[{"$nulls":15},0,0,0,"",{"$nulls":12},0,0,{"v":0,"d":"0.00"}]
[{"$nulls":15},0,0,0,"",{"$nulls":12},0,0,{"v":0,"d":"0.00"}]
[{"$nulls":15},0,0,0,"",{"$nulls":12},0,0,{"v":0,"d":"0.00"}]
[{"$nulls":15},0,0,0,"",{"$nulls":12},0,0,{"v":0,"d":"0.00"}]
[{"$nulls":15},0,0,0,"",{"$nulls":12},0,0,{"v":0,"d":"0.00"}]
[{"$nulls":15},0,0,0,"",{"$nulls":12},0,0,{"v":0,"d":"0.00"}]
[{"$nulls":15},0,0,0,"",{"$nulls":12},0,0,{"v":0,"d":"0.00"}]
[{"$nulls":15},0,0,0,"",{"$nulls":12},0,0,{"v":0,"d":"0.00"}]

{"sheet":"BOB","index":8,"n_rows":33,"n_cols":35,"rows_kept":33}
["název","Bobři","Bodovani","Z1",null,"Z2",null,"Z3",null,"Z4",null,"Z5",null,"Z6",null,"CEL",null,null,"Brankaři","Z1",null,"Z2",null,"Z3",null,"Z4",null,"Z5",null,"Z6",null,"CEL",null,null,"Tresty"]
["kód","BOB",null,"G","N","G","N","G","N","G","N","G","N","G","N","G","N","K",null,"Z","G","Z","G","Z","G","Z","G","Z","G","Z","G","Z","G","%","min celk."]
["info","Hráči","#"]
[null,"Eliáš Mesany",10,null,3,2,2,5,4,{"$nulls":6},{"$f":"D4+F4+H4+J4+L4+N4","v":7},{"$f":"E4+G4+I4+K4+M49+O4","v":9},{"$f":"P4+Q4","v":16},{"$nulls":13},{"$f":"T4+V4+X4+Z4+AB4+AD4","v":0},{"$f":"U4+W4+Y4+AA4+AC4+AE4","v":0},{"$f":"IF(AF4+AG4 < 1,0,AF4*100/(AF4+AG4))","v":{"v":0,"d":"0.00"}}]
["b","Vojtěch Procházka",6,{"$nulls":4},1,4,{"$nulls":6},1,4,{"$f":"P5+Q5","v":5},{"$f":"IF(A5=\"B\",\"X\",\"\")","v":"X"},5,1,5,1,6,11,{"$nulls":6},{"$f":"T5+V5+X5+Z5+AB5+AD5","v":16},13,{"$f":"IF(AF5+AG5 < 1,0,AF5*100/(AF5+AG5))","v":{"v":55.172413793103445,"d":"55.17"}}]
[null,"Matyáš Dolenský",7,3,3,5,4,4,{"$nulls":7},12,7,19,"",{"$nulls":12},0,0,{"v":0,"d":"0.00"}]
[null,"Kryštof Abel",3,5,5,1,9,{"$nulls":8},6,14,20,"",{"$nulls":12},0,0,{"v":0,"d":"0.00"},2]
[null,"Emil Hejda",4,10,2,5,{"$nulls":9},15,2,17,"",{"$nulls":12},0,0,{"v":0,"d":"0.00"}]
[null,"Jonáš Vodňanský",2,7,3,6,2,2,4,{"$nulls":6},15,9,24,"",{"$nulls":12},0,0,{"v":0,"d":"0.00"}]
[{"$nulls":15},{"$f":"D10+F10+H10+J10+L10+N10","v":0},{"$f":"E10+G10+I10+K10+M55+O10","v":0},0,"",{"$nulls":12},0,0,{"v":0,"d":"0.00"}]
[{"$nulls":15},0,0,0,"",{"$nulls":12},0,0,{"v":0,"d":"0.00"}]
[{"$nulls":15},0,0,0,"",{"$nulls":12},0,0,{"v":0,"d":"0.00"}]
[{"$nulls":15},0,0,0,"",{"$nulls":12},0,0,{"v":0,"d":"0.00"}]
[{"$nulls":15},0,0,0,"",{"$nulls":12},0,0,{"v":0,"d":"0.00"}]
[{"$nulls":15},0,0,0,"",{"$nulls":12},0,0,{"v":0,"d":"0.00"}]
[{"$nulls":15},0,0,0,"",{"$nulls":12},0,0,{"v":0,"d":"0.00"}]
[{"$nulls":15},0,0,0,"",{"$nulls":12},0,0,{"v":0,"d":"0.00"}]
[{"$nulls":15},0,0,0,"",{"$nulls":12},0,0,{"v":0,"d":"0.00"}]
[{"$nulls":15},0,0,0,"",{"$nulls":12},0,0,{"v":0,"d":"0.00"}]
[{"$nulls":15},0,0,0,"",{"$nulls":12},0,0,{"v":0,"d":"0.00"}]
[{"$nulls":15},0,0,0,"",{"$nulls":12},0,0,{"v":0,"d":"0.00"}]
[{"$nulls":15},0,0,0,"",{"$nulls":12},0,0,{"v":0,"d":"0.00"}]
[{"$nulls":15},0,0,0,"",{"$nulls":12},0,0,{"v":0,"d":"0.00"}]
[{"$nulls":15},0,0,0,"",{"$nulls":12},0,0,{"v":0,"d":"0.00"}]
[{"$nulls":15},0,0,0,"",{"$nulls":12},0,0,{"v":0,"d":"0.00"}]
[{"$nulls":15},0,0,0,"",{"$nulls":12},0,0,{"v":0,"d":"0.00"}]
[{"$nulls":15},0,0,0,"",{"$nulls":12},0,0,{"v":0,"d":"0.00"}]
[{"$nulls":15},0,0,0,"",{"$nulls":12},0,0,{"v":0,"d":"0.00"}]
[{"$nulls":15},0,0,0,"",{"$nulls":12},0,0,{"v":0,"d":"0.00"}]
[{"$nulls":15},0,0,0,"",{"$nulls":12},0,0,{"v":0,"d":"0.00"}]
[{"$nulls":15},0,0,0,"",{"$nulls":12},0,0,{"v":0,"d":"0.00"}]
[{"$nulls":15},0,0,0,"",{"$nulls":12},0,0,{"v":0,"d":"0.00"}]
[{"$nulls":15},0,0,0,"",{"$nulls":12},0,0,{"v":0,"d":"0.00"}]

{"sheet":"DEM","index":9,"n_rows":33,"n_cols":35,"rows_kept":33}
["název","Démoni","Bodovani","Z1",null,"Z2",null,"Z3",null,"Z4",null,"Z5",null,"Z6",null,"CEL",null,null,"Brankaři","Z1",null,"Z2",null,"Z3",null,"Z4",null,"Z5",null,"Z6",null,"CEL",null,null,"Tresty"]
["kód","DEM",null,"G","N","G","N","G","N","G","N","G","N","G","N","G","N","K",null,"Z","G","Z","G","Z","G","Z","G","Z","G","Z","G","Z","G","%","min celk."]
["info","Hráči","#"]
["B","Hofmanová Lenka",6,{"$nulls":12},{"$f":"D4+F4+H4+J4+L4+N4","v":0},{"$f":"E4+G4+I4+K4+M4+O4","v":0},{"$f":"P4+Q4","v":0},{"$nulls":13},{"$f":"T4+V4+X4+Z4+AB4+AD4","v":0},{"$f":"U4+W4+Y4+AA4+AC4+AE4","v":0},{"$f":"IF(AF4+AG4 < 1,0,AF4*100/(AF4+AG4))","v":{"v":0,"d":"0.00"}}]
[null,"Fulín David *",30,{"$nulls":12},{"$f":"D5+F5+H5+J5+L5+N5","v":0},{"$f":"E5+G5+I5+K5+M5+O5","v":0},{"$f":"P5+Q5","v":0},{"$f":"IF(A5=\"B\",\"X\",\"\")","v":""},{"$nulls":4},10,12,{"$nulls":6},{"$f":"T5+V5+X5+Z5+AB5+AD5","v":10},12,{"$f":"IF(AF5+AG5 < 1,0,AF5*100/(AF5+AG5))","v":{"v":45.45454545454545,"d":"45.45"}},2]
[null,"Krejčovská Michaela *",7,{"$nulls":12},0,0,0,"",{"$nulls":12},0,0,{"v":0,"d":"0.00"}]
[null,"Adámek Albert *",31,1,null,1,{"$nulls":9},2,0,2,"",{"$nulls":12},0,0,{"v":0,"d":"0.00"},4]
[null,"Sejková Berenika *",10,{"$nulls":12},0,0,0,"x",12,25,{"$nulls":10},12,25,{"v":32.432432432432435,"d":"32.43"}]
[null,"Sejková Viola *",41,{"$nulls":12},0,0,0,"x",null,null,18,22,{"$nulls":8},18,22,{"v":45,"d":"45.00"}]
[null,"Sejk Jáchym",4,{"$nulls":12},0,0,0,"",{"$nulls":12},0,0,{"v":0,"d":"0.00"}]
[null,"Vaněčková Dorota *",99,{"$nulls":12},0,0,0,"",{"$nulls":12},0,0,{"v":0,"d":"0.00"}]
[null,"Jirovský Matyáš *",8,{"$nulls":12},0,0,0,"",{"$nulls":12},0,0,{"v":0,"d":"0.00"}]
[{"$nulls":15},{"$f":"D13+F13+H13+J13+L13+N13","v":0},0,{"$f":"P13+Q13","v":0},"",{"$nulls":12},0,0,{"v":0,"d":"0.00"}]
[{"$nulls":15},0,0,{"$f":"P14+Q14","v":0},"",{"$nulls":12},0,0,{"v":0,"d":"0.00"}]
[{"$nulls":15},0,0,{"$f":"P15+Q15","v":0},"",{"$nulls":12},0,0,{"v":0,"d":"0.00"}]
[{"$nulls":15},{"$f":"D16+F16+H16+J16+L16+N16","v":0},{"$f":"E16+G16+I16+K16+M16+O16","v":0},{"$f":"P16+Q16","v":0},"",{"$nulls":12},0,0,{"v":0,"d":"0.00"}]
[{"$nulls":15},{"$f":"D17+F17+H17+J17+L17+N17","v":0},{"$f":"E17+G17+I17+K17+M17+O17","v":0},{"$f":"P17+Q17","v":0},"",{"$nulls":12},0,0,{"v":0,"d":"0.00"}]
[{"$nulls":18},"",{"$nulls":12},0,0,{"v":0,"d":"0.00"}]
[{"$nulls":18},"",{"$nulls":12},0,0,{"v":0,"d":"0.00"}]
[{"$nulls":18},"",{"$nulls":12},0,0,{"v":0,"d":"0.00"}]
[{"$nulls":18},"",{"$nulls":12},0,0,{"v":0,"d":"0.00"}]
[{"$nulls":18},"",{"$nulls":12},0,0,{"v":0,"d":"0.00"}]
[{"$nulls":18},"",{"$nulls":12},0,0,{"v":0,"d":"0.00"}]
[{"$nulls":18},"",{"$nulls":12},0,0,{"v":0,"d":"0.00"}]
[{"$nulls":18},"",{"$nulls":12},0,0,{"v":0,"d":"0.00"}]
[{"$nulls":18},"",{"$nulls":12},0,0,{"v":0,"d":"0.00"}]
[{"$nulls":18},"",{"$nulls":12},0,0,{"v":0,"d":"0.00"}]
[{"$nulls":18},"",{"$nulls":12},0,0,{"v":0,"d":"0.00"}]
[{"$nulls":18},"",{"$nulls":12},0,0,{"v":0,"d":"0.00"}]
[{"$nulls":18},"",{"$nulls":12},0,0,{"v":0,"d":"0.00"}]
[{"$nulls":18},"",{"$nulls":12},0,0,{"v":0,"d":"0.00"}]
[{"$nulls":18},"",{"$nulls":12},0,0,{"v":0,"d":"0.00"}]
[{"$nulls":18},"",{"$nulls":12},0,0,{"v":0,"d":"0.00"}]

{"sheet":"T5","index":10,"n_rows":33,"n_cols":35,"rows_kept":33,"hidden":true}
["název","T5","Bodovani","Z1",null,"Z2",null,"Z3",null,"Z4",null,"Z5",null,"Z6",null,"CEL",null,null,"Brankaři","Z1",null,"Z2",null,"Z3",null,"Z4",null,"Z5",null,"Z6",null,"CEL",null,null,"Tresty"]
["kód","T5",null,"G","N","G","N","G","N","G","N","G","N","G","N","G","N","K",null,"Z","G","Z","G","Z","G","Z","G","Z","G","Z","G","Z","G","%","min celk."]
["info","Hráči","#"]
[{"$nulls":15},{"$f":"D4+F4+H4+J4+L4+N4","v":0},{"$f":"E4+G4+I4+K4+M4+O4","v":0},{"$f":"P4+Q4","v":0},{"$f":"IF(A4=\"B\",\"X\",\"\")","v":""},{"$nulls":12},{"$f":"T4+V4+X4+Z4+AB4+AD4","v":0},{"$f":"U4+W4+Y4+AA4+AC4+AE4","v":0},{"$f":"IF(AF4+AG4 < 1,0,AF4*100/(AF4+AG4))","v":{"v":0,"d":"0.00"}}]
[{"$nulls":15},{"$f":"D5+F5+H5+J5+L5+N5","v":0},{"$f":"E5+G5+I5+K5+M5+O5","v":0},{"$f":"P5+Q5","v":0},{"$f":"IF(A5=\"B\",\"X\",\"\")","v":""},{"$nulls":12},{"$f":"T5+V5+X5+Z5+AB5+AD5","v":0},0,{"$f":"IF(AF5+AG5 < 1,0,AF5*100/(AF5+AG5))","v":{"v":0,"d":"0.00"}}]
[{"$nulls":15},0,0,0,"",{"$nulls":12},0,0,{"v":0,"d":"0.00"}]
[{"$nulls":15},0,0,0,"",{"$nulls":12},0,0,{"v":0,"d":"0.00"}]
[{"$nulls":15},0,0,0,"",{"$nulls":12},0,0,{"v":0,"d":"0.00"}]
[{"$nulls":15},0,0,0,"",{"$nulls":12},0,0,{"v":0,"d":"0.00"}]
[{"$nulls":15},0,0,0,"",{"$nulls":12},0,0,{"v":0,"d":"0.00"}]
[{"$nulls":15},0,0,0,"",{"$nulls":12},0,0,{"v":0,"d":"0.00"}]
[{"$nulls":15},0,0,0,"",{"$nulls":12},0,0,{"v":0,"d":"0.00"}]
[{"$nulls":15},0,0,0,"",{"$nulls":12},0,0,{"v":0,"d":"0.00"}]
[{"$nulls":15},0,0,0,"",{"$nulls":12},0,0,{"v":0,"d":"0.00"}]
[{"$nulls":15},0,0,0,"",{"$nulls":12},0,0,{"v":0,"d":"0.00"}]
[{"$nulls":15},0,0,0,"",{"$nulls":12},0,0,{"v":0,"d":"0.00"}]
[{"$nulls":15},0,0,0,"",{"$nulls":12},0,0,{"v":0,"d":"0.00"}]
[{"$nulls":15},0,0,0,"",{"$nulls":12},0,0,{"v":0,"d":"0.00"}]
[{"$nulls":15},0,0,0,"",{"$nulls":12},0,0,{"v":0,"d":"0.00"}]
[{"$nulls":15},0,0,0,"",{"$nulls":12},0,0,{"v":0,"d":"0.00"}]
[{"$nulls":15},0,0,0,"",{"$nulls":12},0,0,{"v":0,"d":"0.00"}]
[{"$nulls":15},0,0,0,"",{"$nulls":12},0,0,{"v":0,"d":"0.00"}]
[{"$nulls":15},0,0,0,"",{"$nulls":12},0,0,{"v":0,"d":"0.00"}]
[{"$nulls":15},0,0,0,"",{"$nulls":12},0,0,{"v":0,"d":"0.00"}]
[{"$nulls":15},0,0,0,"",{"$nulls":12},0,0,{"v":0,"d":"0.00"}]
[{"$nulls":15},0,0,0,"",{"$nulls":12},0,0,{"v":0,"d":"0.00"}]
[{"$nulls":15},0,0,0,"",{"$nulls":12},0,0,{"v":0,"d":"0.00"}]
[{"$nulls":15},0,0,0,"",{"$nulls":12},0,0,{"v":0,"d":"0.00"}]
[{"$nulls":15},0,0,0,"",{"$nulls":12},0,0,{"v":0,"d":"0.00"}]
[{"$nulls":15},0,0,0,"",{"$nulls":12},0,0,{"v":0,"d":"0.00"}]
[{"$nulls":15},0,0,0,"",{"$nulls":12},0,0,{"v":0,"d":"0.00"}]
[{"$nulls":15},0,0,0,"",{"$nulls":12},0,0,{"v":0,"d":"0.00"}]
[{"$nulls":15},0,0,0,"",{"$nulls":12},0,0,{"v":0,"d":"0.00"}]

{"sheet":"T6","index":11,"n_rows":33,"n_cols":35,"rows_kept":33,"hidden":true}
["název",null,"Bodovani","Z1",null,"Z2",null,"Z3",null,"Z4",null,"Z5",null,"Z6",null,"CEL",null,null,"Brankaři","Z1",null,"Z2",null,"Z3",null,"Z4",null,"Z5",null,"Z6",null,"CEL",null,null,"Tresty"]
["kód",null,null,"G","N","G","N","G","N","G","N","G","N","G","N","G","N","K",null,"Z","G","Z","G","Z","G","Z","G","Z","G","Z","G","Z","G","%","min celk."]
["info","Hráči","#"]
[{"$nulls":15},{"$f":"D4+F4+H4+J4+L4+N4","v":0},{"$f":"E4+G4+I4+K4+M4+O4","v":0},{"$f":"P4+Q4","v":0},{"$f":"IF(A4=\"B\",\"X\",\"\")","v":""},{"$nulls":12},{"$f":"T4+V4+X4+Z4+AB4+AD4","v":0},{"$f":"U4+W4+Y4+AA4+AC4+AE4","v":0},{"$f":"IF(AF4+AG4 < 1,0,AF4*100/(AF4+AG4))","v":{"v":0,"d":"0.00"}}]
[{"$nulls":15},{"$f":"D5+F5+H5+J5+L5+N5","v":0},0,{"$f":"P5+Q5","v":0},{"$f":"IF(A5=\"B\",\"X\",\"\")","v":""},{"$nulls":12},{"$f":"T5+V5+X5+Z5+AB5+AD5","v":0},0,{"$f":"IF(AF5+AG5 < 1,0,AF5*100/(AF5+AG5))","v":{"v":0,"d":"0.00"}}]
[{"$nulls":15},0,0,0,"",{"$nulls":12},0,0,{"v":0,"d":"0.00"}]
[{"$nulls":15},0,0,0,"",{"$nulls":12},0,0,{"v":0,"d":"0.00"}]
[{"$nulls":15},0,0,0,"",{"$nulls":12},0,0,{"v":0,"d":"0.00"}]
[{"$nulls":15},0,0,0,"",{"$nulls":12},0,0,{"v":0,"d":"0.00"}]
[{"$nulls":15},0,0,0,"",{"$nulls":12},0,0,{"v":0,"d":"0.00"}]
[{"$nulls":15},0,0,0,"",{"$nulls":12},0,0,{"v":0,"d":"0.00"}]
[{"$nulls":15},0,0,0,"",{"$nulls":12},0,0,{"v":0,"d":"0.00"}]
[{"$nulls":15},0,0,0,"",{"$nulls":12},0,0,{"v":0,"d":"0.00"}]
[{"$nulls":15},0,0,0,"",{"$nulls":12},0,0,{"v":0,"d":"0.00"}]
[{"$nulls":15},0,0,0,"",{"$nulls":12},0,0,{"v":0,"d":"0.00"}]
[{"$nulls":15},0,0,0,"",{"$nulls":12},0,0,{"v":0,"d":"0.00"}]
[{"$nulls":15},0,0,0,"",{"$nulls":12},0,0,{"v":0,"d":"0.00"}]
[{"$nulls":15},0,0,0,"",{"$nulls":12},0,0,{"v":0,"d":"0.00"}]
[{"$nulls":15},0,0,0,"",{"$nulls":12},0,0,{"v":0,"d":"0.00"}]
[{"$nulls":15},0,0,0,"",{"$nulls":12},0,0,{"v":0,"d":"0.00"}]
[{"$nulls":15},0,0,0,"",{"$nulls":12},0,0,{"v":0,"d":"0.00"}]
[{"$nulls":15},0,0,0,"",{"$nulls":12},0,0,{"v":0,"d":"0.00"}]
[{"$nulls":15},0,0,0,"",{"$nulls":12},0,0,{"v":0,"d":"0.00"}]
[{"$nulls":15},0,0,0,"",{"$nulls":12},0,0,{"v":0,"d":"0.00"}]
[{"$nulls":15},0,0,0,"",{"$nulls":12},0,0,{"v":0,"d":"0.00"}]
[{"$nulls":15},0,0,0,"",{"$nulls":12},0,0,{"v":0,"d":"0.00"}]
[{"$nulls":15},0,0,0,"",{"$nulls":12},0,0,{"v":0,"d":"0.00"}]
[{"$nulls":15},0,0,0,"",{"$nulls":12},0,0,{"v":0,"d":"0.00"}]
[{"$nulls":15},0,0,0,"",{"$nulls":12},0,0,{"v":0,"d":"0.00"}]
[{"$nulls":15},0,0,0,"",{"$nulls":12},0,0,{"v":0,"d":"0.00"}]
[{"$nulls":15},0,0,0,"",{"$nulls":12},0,0,{"v":0,"d":"0.00"}]
[{"$nulls":15},0,0,0,"",{"$nulls":12},0,0,{"v":0,"d":"0.00"}]
[{"$nulls":15},0,0,0,"",{"$nulls":12},0,0,{"v":0,"d":"0.00"}]

{"sheet":"T7","index":12,"n_rows":33,"n_cols":35,"rows_kept":33,"hidden":true}
["název",null,"Bodovani","Z1",null,"Z2",null,"Z3",null,"Z4",null,"Z5",null,"Z6",null,"CEL",null,null,"Brankaři","Z1",null,"Z2",null,"Z3",null,"Z4",null,"Z5",null,"Z6",null,"CEL",null,null,"Tresty"]
["kód",null,null,"G","N","G","N","G","N","G","N","G","N","G","N","G","N","K",null,"Z","G","Z","G","Z","G","Z","G","Z","G","Z","G","Z","G","%","min celk."]
["info","Hráči","#"]
[{"$nulls":15},{"$f":"D4+F4+H4+J4+L4+N4","v":0},{"$f":"E4+G4+I4+K4+M4+O4","v":0},{"$f":"P4+Q4","v":0},{"$f":"IF(A4=\"B\",\"X\",\"\")","v":""},{"$nulls":12},{"$f":"T4+V4+X4+Z4+AB4+AD4","v":0},{"$f":"U4+W4+Y4+AA4+AC4+AE4","v":0},{"$f":"IF(AF4+AG4 < 1,0,AF4*100/(AF4+AG4))","v":{"v":0,"d":"0.00"}}]
[{"$nulls":15},{"$f":"D5+F5+H5+J5+L5+N5","v":0},0,{"$f":"P5+Q5","v":0},{"$f":"IF(A5=\"B\",\"X\",\"\")","v":""},{"$nulls":12},{"$f":"T5+V5+X5+Z5+AB5+AD5","v":0},0,{"$f":"IF(AF5+AG5 < 1,0,AF5*100/(AF5+AG5))","v":{"v":0,"d":"0.00"}}]
[{"$nulls":15},0,0,0,"",{"$nulls":12},0,0,{"v":0,"d":"0.00"}]
[{"$nulls":15},0,0,0,"",{"$nulls":12},0,0,{"v":0,"d":"0.00"}]
[{"$nulls":15},0,0,0,"",{"$nulls":12},0,0,{"v":0,"d":"0.00"}]
[{"$nulls":15},0,0,0,"",{"$nulls":12},0,0,{"v":0,"d":"0.00"}]
[{"$nulls":15},0,0,0,"",{"$nulls":12},0,0,{"v":0,"d":"0.00"}]
[{"$nulls":15},0,0,0,"",{"$nulls":12},0,0,{"v":0,"d":"0.00"}]
[{"$nulls":15},0,0,0,"",{"$nulls":12},0,0,{"v":0,"d":"0.00"}]
[{"$nulls":15},0,0,0,"",{"$nulls":12},0,0,{"v":0,"d":"0.00"}]
[{"$nulls":15},0,0,0,"",{"$nulls":12},0,0,{"v":0,"d":"0.00"}]
[{"$nulls":15},0,0,0,"",{"$nulls":12},0,0,{"v":0,"d":"0.00"}]
[{"$nulls":15},0,0,0,"",{"$nulls":12},0,0,{"v":0,"d":"0.00"}]
[{"$nulls":15},0,0,0,"",{"$nulls":12},0,0,{"v":0,"d":"0.00"}]
[{"$nulls":15},0,0,0,"",{"$nulls":12},0,0,{"v":0,"d":"0.00"}]
[{"$nulls":15},0,0,0,"",{"$nulls":12},0,0,{"v":0,"d":"0.00"}]
[{"$nulls":15},0,0,0,"",{"$nulls":12},0,0,{"v":0,"d":"0.00"}]
[{"$nulls":15},0,0,0,"",{"$nulls":12},0,0,{"v":0,"d":"0.00"}]
[{"$nulls":15},0,0,0,"",{"$nulls":12},0,0,{"v":0,"d":"0.00"}]
[{"$nulls":15},0,0,0,"",{"$nulls":12},0,0,{"v":0,"d":"0.00"}]
[{"$nulls":15},0,0,0,"",{"$nulls":12},0,0,{"v":0,"d":"0.00"}]
[{"$nulls":15},0,0,0,"",{"$nulls":12},0,0,{"v":0,"d":"0.00"}]
[{"$nulls":15},0,0,0,"",{"$nulls":12},0,0,{"v":0,"d":"0.00"}]
[{"$nulls":15},0,0,0,"",{"$nulls":12},0,0,{"v":0,"d":"0.00"}]
[{"$nulls":15},0,0,0,"",{"$nulls":12},0,0,{"v":0,"d":"0.00"}]
[{"$nulls":15},0,0,0,"",{"$nulls":12},0,0,{"v":0,"d":"0.00"}]
[{"$nulls":15},0,0,0,"",{"$nulls":12},0,0,{"v":0,"d":"0.00"}]
[{"$nulls":15},0,0,0,"",{"$nulls":12},0,0,{"v":0,"d":"0.00"}]
[{"$nulls":15},0,0,0,"",{"$nulls":12},0,0,{"v":0,"d":"0.00"}]
[{"$nulls":15},0,0,0,"",{"$nulls":12},0,0,{"v":0,"d":"0.00"}]

{"sheet":"T8","index":13,"n_rows":33,"n_cols":35,"rows_kept":33,"hidden":true}
["název",null,"Bodovani","Z1",null,"Z2",null,"Z3",null,"Z4",null,"Z5",null,"Z6",null,"CEL",null,null,"Brankaři","Z1",null,"Z2",null,"Z3",null,"Z4",null,"Z5",null,"Z6",null,"CEL",null,null,"Tresty"]
["kód",null,null,"G","N","G","N","G","N","G","N","G","N","G","N","G","N","K",null,"Z","G","Z","G","Z","G","Z","G","Z","G","Z","G","Z","G","%","min celk."]
["info","Hráči","#"]
[{"$nulls":15},{"$f":"D4+F4+H4+J4+L4+N4","v":0},{"$f":"E4+G4+I4+K4+M4+O4","v":0},{"$f":"P4+Q4","v":0},{"$f":"IF(A4=\"B\",\"X\",\"\")","v":""},{"$nulls":12},{"$f":"T4+V4+X4+Z4+AB4+AD4","v":0},{"$f":"U4+W4+Y4+AA4+AC4+AE4","v":0},{"$f":"IF(AF4+AG4 < 1,0,AF4*100/(AF4+AG4))","v":{"v":0,"d":"0.00"}}]
[{"$nulls":15},{"$f":"D5+F5+H5+J5+L5+N5","v":0},0,{"$f":"P5+Q5","v":0},{"$f":"IF(A5=\"B\",\"X\",\"\")","v":""},{"$nulls":12},{"$f":"T5+V5+X5+Z5+AB5+AD5","v":0},0,{"$f":"IF(AF5+AG5 < 1,0,AF5*100/(AF5+AG5))","v":{"v":0,"d":"0.00"}}]
[{"$nulls":15},0,0,0,"",{"$nulls":12},0,0,{"v":0,"d":"0.00"}]
[{"$nulls":15},0,0,0,"",{"$nulls":12},0,0,{"v":0,"d":"0.00"}]
[{"$nulls":15},0,0,0,"",{"$nulls":12},0,0,{"v":0,"d":"0.00"}]
[{"$nulls":15},0,0,0,"",{"$nulls":12},0,0,{"v":0,"d":"0.00"}]
[{"$nulls":15},0,0,0,"",{"$nulls":12},0,0,{"v":0,"d":"0.00"}]
[{"$nulls":15},0,0,0,"",{"$nulls":12},0,0,{"v":0,"d":"0.00"}]
[{"$nulls":15},0,0,0,"",{"$nulls":12},0,0,{"v":0,"d":"0.00"}]
[{"$nulls":15},0,0,0,"",{"$nulls":12},0,0,{"v":0,"d":"0.00"}]
[{"$nulls":15},0,0,0,"",{"$nulls":12},0,0,{"v":0,"d":"0.00"}]
[{"$nulls":15},0,0,0,"",{"$nulls":12},0,0,{"v":0,"d":"0.00"}]
[{"$nulls":15},0,0,0,"",{"$nulls":12},0,0,{"v":0,"d":"0.00"}]
[{"$nulls":15},0,0,0,"",{"$nulls":12},0,0,{"v":0,"d":"0.00"}]
[{"$nulls":15},0,0,0,"",{"$nulls":12},0,0,{"v":0,"d":"0.00"}]
[{"$nulls":15},0,0,0,"",{"$nulls":12},0,0,{"v":0,"d":"0.00"}]
[{"$nulls":15},0,0,0,"",{"$nulls":12},0,0,{"v":0,"d":"0.00"}]
[{"$nulls":15},0,0,0,"",{"$nulls":12},0,0,{"v":0,"d":"0.00"}]
[{"$nulls":15},0,0,0,"",{"$nulls":12},0,0,{"v":0,"d":"0.00"}]
[{"$nulls":15},0,0,0,"",{"$nulls":12},0,0,{"v":0,"d":"0.00"}]
[{"$nulls":15},0,0,0,"",{"$nulls":12},0,0,{"v":0,"d":"0.00"}]
[{"$nulls":15},0,0,0,"",{"$nulls":12},0,0,{"v":0,"d":"0.00"}]
[{"$nulls":15},0,0,0,"",{"$nulls":12},0,0,{"v":0,"d":"0.00"}]
[{"$nulls":15},0,0,0,"",{"$nulls":12},0,0,{"v":0,"d":"0.00"}]
[{"$nulls":15},0,0,0,"",{"$nulls":12},0,0,{"v":0,"d":"0.00"}]
[{"$nulls":15},0,0,0,"",{"$nulls":12},0,0,{"v":0,"d":"0.00"}]
[{"$nulls":15},0,0,0,"",{"$nulls":12},0,0,{"v":0,"d":"0.00"}]
[{"$nulls":15},0,0,0,"",{"$nulls":12},0,0,{"v":0,"d":"0.00"}]
[{"$nulls":15},0,0,0,"",{"$nulls":12},0,0,{"v":0,"d":"0.00"}]
[{"$nulls":15},0,0,0,"",{"$nulls":12},0,0,{"v":0,"d":"0.00"}]

{"sheet":"CELKEM","index":14,"n_rows":67,"n_cols":13,"rows_kept":67,"hidden":true}
[null,null,"G1","N1","G2","N2","G3","N3","G4","N4","G","N","K"]
["Čech Roman","HIG",19,9,29,8,31,10,{"$f":"INDIRECT(CONCATENATE(\"Statistiky!C\",  MATCH(A2,Statistiky!$A$2:$A$71,0)+1))","v":{"$error":"#N/A"}},{"$f":"INDIRECT(CONCATENATE(\"Statistiky!D\",  MATCH(A2,Statistiky!$A$2:$A$71,0)+1))","v":{"$error":"#N/A"}},{"$f":"C2+E2+G2+I2","v":{"$error":"#N/A"}},{"$f":"D2+F2+H2+J2","v":{"$error":"#N/A"}},{"$f":"K2+L2","v":{"$error":"#N/A"}}]
["Katzer Tomáš","HIG",13,2,18,9,14,4,{"$f":"INDIRECT(CONCATENATE(\"Statistiky!C\",  MATCH(A3,Statistiky!$A$2:$A$71,0)+1))","v":{"$error":"#N/A"}},{"$f":"INDIRECT(CONCATENATE(\"Statistiky!D\",  MATCH(A3,Statistiky!$A$2:$A$71,0)+1))","v":{"$error":"#N/A"}},{"$f":"C3+E3+G3+I3","v":{"$error":"#N/A"}},{"$error":"#N/A"},{"$f":"K3+L3","v":{"$error":"#N/A"}}]
["Vladimír Vrabko","ORL",12,4,17,4,14,6,{"$f":"INDIRECT(CONCATENATE(\"Statistiky!C\",  MATCH(A4,Statistiky!$A$2:$A$71,0)+1))","v":{"$error":"#N/A"}},{"$f":"INDIRECT(CONCATENATE(\"Statistiky!D\",  MATCH(A4,Statistiky!$A$2:$A$71,0)+1))","v":{"$error":"#N/A"}},{"$error":"#N/A"},{"$error":"#N/A"},{"$error":"#N/A"}]
["Petr Němčík ","DZO",12,8,15,9,14,9,{"$f":"INDIRECT(CONCATENATE(\"Statistiky!C\",  MATCH(A5,Statistiky!$A$2:$A$71,0)+1))","v":{"$error":"#N/A"}},{"$f":"INDIRECT(CONCATENATE(\"Statistiky!D\",  MATCH(A5,Statistiky!$A$2:$A$71,0)+1))","v":{"$error":"#N/A"}},{"$error":"#N/A"},{"$error":"#N/A"},{"$error":"#N/A"}]
["Pavel Mikuš","ORL",12,6,4,2,8,12,{"$f":"INDIRECT(CONCATENATE(\"Statistiky!C\",  MATCH(A6,Statistiky!$A$2:$A$71,0)+1))","v":{"$error":"#N/A"}},{"$f":"INDIRECT(CONCATENATE(\"Statistiky!D\",  MATCH(A6,Statistiky!$A$2:$A$71,0)+1))","v":{"$error":"#N/A"}},{"$error":"#N/A"},{"$error":"#N/A"},{"$error":"#N/A"}]
["Diblík Jan","HIG",4,9,3,9,6,13,{"$f":"INDIRECT(CONCATENATE(\"Statistiky!C\",  MATCH(A7,Statistiky!$A$2:$A$71,0)+1))","v":{"$error":"#N/A"}},{"$f":"INDIRECT(CONCATENATE(\"Statistiky!D\",  MATCH(A7,Statistiky!$A$2:$A$71,0)+1))","v":{"$error":"#N/A"}},{"$error":"#N/A"},{"$error":"#N/A"},{"$error":"#N/A"}]
["Adam Štefanka","ORL",12,3,0,0,16,6,{"$f":"INDIRECT(CONCATENATE(\"Statistiky!C\",  MATCH(A8,Statistiky!$A$2:$A$71,0)+1))","v":{"$error":"#N/A"}},{"$f":"INDIRECT(CONCATENATE(\"Statistiky!D\",  MATCH(A8,Statistiky!$A$2:$A$71,0)+1))","v":{"$error":"#N/A"}},{"$error":"#N/A"},{"$error":"#N/A"},{"$error":"#N/A"}]
["Martin Koubek","WAR",null,null,18,6,10,10,{"$f":"INDIRECT(CONCATENATE(\"Statistiky!C\",  MATCH(A9,Statistiky!$A$2:$A$71,0)+1))","v":{"$error":"#N/A"}},{"$f":"INDIRECT(CONCATENATE(\"Statistiky!D\",  MATCH(A9,Statistiky!$A$2:$A$71,0)+1))","v":{"$error":"#N/A"}},{"$error":"#N/A"},{"$error":"#N/A"},{"$error":"#N/A"}]
["Josef Procházka","WAR",5,4,6,4,9,4,{"$f":"INDIRECT(CONCATENATE(\"Statistiky!C\",  MATCH(A10,Statistiky!$A$2:$A$71,0)+1))","v":{"$error":"#N/A"}},{"$f":"INDIRECT(CONCATENATE(\"Statistiky!D\",  MATCH(A10,Statistiky!$A$2:$A$71,0)+1))","v":{"$error":"#N/A"}},{"$error":"#N/A"},{"$error":"#N/A"},{"$error":"#N/A"}]
["Pavel Gorčík","WAR",7,1,4,5,11,5,{"$f":"INDIRECT(CONCATENATE(\"Statistiky!C\",  MATCH(A11,Statistiky!$A$2:$A$71,0)+1))","v":{"$error":"#N/A"}},{"$f":"INDIRECT(CONCATENATE(\"Statistiky!D\",  MATCH(A11,Statistiky!$A$2:$A$71,0)+1))","v":{"$error":"#N/A"}},{"$error":"#N/A"},{"$error":"#N/A"},{"$error":"#N/A"}]
["Karel Slíva","WAR",null,null,6,3,11,6,{"$f":"INDIRECT(CONCATENATE(\"Statistiky!C\",  MATCH(A12,Statistiky!$A$2:$A$71,0)+1))","v":{"$error":"#N/A"}},{"$f":"INDIRECT(CONCATENATE(\"Statistiky!D\",  MATCH(A12,Statistiky!$A$2:$A$71,0)+1))","v":{"$error":"#N/A"}},{"$error":"#N/A"},{"$error":"#N/A"},{"$error":"#N/A"}]
["Macek Martin","HIG",null,null,6,4,16,10,{"$f":"INDIRECT(CONCATENATE(\"Statistiky!C\",  MATCH(A13,Statistiky!$A$2:$A$71,0)+1))","v":{"$error":"#N/A"}},{"$f":"INDIRECT(CONCATENATE(\"Statistiky!D\",  MATCH(A13,Statistiky!$A$2:$A$71,0)+1))","v":{"$error":"#N/A"}},{"$error":"#N/A"},{"$error":"#N/A"},{"$error":"#N/A"}]
["Pavel Gajdoš ","DZO",10,7,12,4,null,null,{"$f":"INDIRECT(CONCATENATE(\"Statistiky!C\",  MATCH(A14,Statistiky!$A$2:$A$71,0)+1))","v":{"$error":"#N/A"}},{"$f":"INDIRECT(CONCATENATE(\"Statistiky!D\",  MATCH(A14,Statistiky!$A$2:$A$71,0)+1))","v":{"$error":"#N/A"}},{"$error":"#N/A"},{"$error":"#N/A"},{"$error":"#N/A"}]
["Pavel Paseka","DZO",4,6,0,0,15,5,{"$f":"INDIRECT(CONCATENATE(\"Statistiky!C\",  MATCH(A15,Statistiky!$A$2:$A$71,0)+1))","v":{"$error":"#N/A"}},{"$f":"INDIRECT(CONCATENATE(\"Statistiky!D\",  MATCH(A15,Statistiky!$A$2:$A$71,0)+1))","v":{"$error":"#N/A"}},{"$error":"#N/A"},{"$error":"#N/A"},{"$error":"#N/A"}]
["Jan Kadlec","ORL",2,6,9,4,4,4,{"$f":"INDIRECT(CONCATENATE(\"Statistiky!C\",  MATCH(A16,Statistiky!$A$2:$A$71,0)+1))","v":{"$error":"#N/A"}},{"$f":"INDIRECT(CONCATENATE(\"Statistiky!D\",  MATCH(A16,Statistiky!$A$2:$A$71,0)+1))","v":{"$error":"#N/A"}},{"$error":"#N/A"},{"$error":"#N/A"},{"$error":"#N/A"}]
["Pospíšil Jan","HIG",8,1,9,4,null,null,{"$f":"INDIRECT(CONCATENATE(\"Statistiky!C\",  MATCH(A17,Statistiky!$A$2:$A$71,0)+1))","v":{"$error":"#N/A"}},{"$f":"INDIRECT(CONCATENATE(\"Statistiky!D\",  MATCH(A17,Statistiky!$A$2:$A$71,0)+1))","v":{"$error":"#N/A"}},{"$error":"#N/A"},{"$error":"#N/A"},{"$error":"#N/A"}]
["Aneta Šandová ","DZO",4,4,5,6,3,4,{"$f":"INDIRECT(CONCATENATE(\"Statistiky!C\",  MATCH(A18,Statistiky!$A$2:$A$71,0)+1))","v":{"$error":"#N/A"}},{"$f":"INDIRECT(CONCATENATE(\"Statistiky!D\",  MATCH(A18,Statistiky!$A$2:$A$71,0)+1))","v":{"$error":"#N/A"}},{"$error":"#N/A"},{"$error":"#N/A"},{"$error":"#N/A"}]
["Horký Pavel","HIG",5,6,5,7,1,1,{"$f":"INDIRECT(CONCATENATE(\"Statistiky!C\",  MATCH(A19,Statistiky!$A$2:$A$71,0)+1))","v":{"$error":"#N/A"}},{"$f":"INDIRECT(CONCATENATE(\"Statistiky!D\",  MATCH(A19,Statistiky!$A$2:$A$71,0)+1))","v":{"$error":"#N/A"}},{"$error":"#N/A"},{"$error":"#N/A"},{"$error":"#N/A"}]
["Kubík Michal","HIG",3,6,0,0,10,5,{"$f":"INDIRECT(CONCATENATE(\"Statistiky!C\",  MATCH(A20,Statistiky!$A$2:$A$71,0)+1))","v":{"$error":"#N/A"}},{"$f":"INDIRECT(CONCATENATE(\"Statistiky!D\",  MATCH(A20,Statistiky!$A$2:$A$71,0)+1))","v":{"$error":"#N/A"}},{"$error":"#N/A"},{"$error":"#N/A"},{"$error":"#N/A"}]
["Milena Ebergenyiová","DEW",10,2,7,0,0,2,{"$f":"INDIRECT(CONCATENATE(\"Statistiky!C\",  MATCH(A21,Statistiky!$A$2:$A$71,0)+1))","v":{"$error":"#N/A"}},{"$f":"INDIRECT(CONCATENATE(\"Statistiky!D\",  MATCH(A21,Statistiky!$A$2:$A$71,0)+1))","v":{"$error":"#N/A"}},{"$error":"#N/A"},{"$error":"#N/A"},{"$error":"#N/A"}]
["Jakub Sypták","DEW",4,4,0,2,10,null,{"$f":"INDIRECT(CONCATENATE(\"Statistiky!C\",  MATCH(A22,Statistiky!$A$2:$A$71,0)+1))","v":{"$error":"#N/A"}},{"$f":"INDIRECT(CONCATENATE(\"Statistiky!D\",  MATCH(A22,Statistiky!$A$2:$A$71,0)+1))","v":{"$error":"#N/A"}},{"$error":"#N/A"},{"$error":"#N/A"},{"$error":"#N/A"}]
["Hoplíček Ondřej","HIG",3,3,0,0,4,7,{"$f":"INDIRECT(CONCATENATE(\"Statistiky!C\",  MATCH(A23,Statistiky!$A$2:$A$71,0)+1))","v":{"$error":"#N/A"}},{"$f":"INDIRECT(CONCATENATE(\"Statistiky!D\",  MATCH(A23,Statistiky!$A$2:$A$71,0)+1))","v":{"$error":"#N/A"}},{"$error":"#N/A"},{"$error":"#N/A"},{"$error":"#N/A"}]
["Jan Valový","ORL",null,null,0,0,9,4,{"$f":"INDIRECT(CONCATENATE(\"Statistiky!C\",  MATCH(A24,Statistiky!$A$2:$A$71,0)+1))","v":{"$error":"#N/A"}},{"$f":"INDIRECT(CONCATENATE(\"Statistiky!D\",  MATCH(A24,Statistiky!$A$2:$A$71,0)+1))","v":{"$error":"#N/A"}},{"$error":"#N/A"},{"$error":"#N/A"},{"$error":"#N/A"}]
["Matěj Melichar ","DZO",7,5,5,4,1,0,{"$f":"INDIRECT(CONCATENATE(\"Statistiky!C\",  MATCH(A25,Statistiky!$A$2:$A$71,0)+1))","v":{"$error":"#N/A"}},{"$f":"INDIRECT(CONCATENATE(\"Statistiky!D\",  MATCH(A25,Statistiky!$A$2:$A$71,0)+1))","v":{"$error":"#N/A"}},{"$error":"#N/A"},{"$error":"#N/A"},{"$error":"#N/A"}]
["Skalický Petr","HIG",null,null,8,3,null,null,{"$f":"INDIRECT(CONCATENATE(\"Statistiky!C\",  MATCH(A26,Statistiky!$A$2:$A$71,0)+1))","v":{"$error":"#N/A"}},{"$f":"INDIRECT(CONCATENATE(\"Statistiky!D\",  MATCH(A26,Statistiky!$A$2:$A$71,0)+1))","v":{"$error":"#N/A"}},{"$error":"#N/A"},{"$error":"#N/A"},{"$error":"#N/A"}]
["Jiří Dudák","WAR",4,1,5,7,null,null,{"$f":"INDIRECT(CONCATENATE(\"Statistiky!C\",  MATCH(A27,Statistiky!$A$2:$A$71,0)+1))","v":{"$error":"#N/A"}},{"$f":"INDIRECT(CONCATENATE(\"Statistiky!D\",  MATCH(A27,Statistiky!$A$2:$A$71,0)+1))","v":{"$error":"#N/A"}},{"$error":"#N/A"},{"$error":"#N/A"},{"$error":"#N/A"}]
["Lukáš Palatinus","ORL",4,3,0,0,6,3,{"$f":"INDIRECT(CONCATENATE(\"Statistiky!C\",  MATCH(A28,Statistiky!$A$2:$A$71,0)+1))","v":{"$error":"#N/A"}},{"$f":"INDIRECT(CONCATENATE(\"Statistiky!D\",  MATCH(A28,Statistiky!$A$2:$A$71,0)+1))","v":{"$error":"#N/A"}},{"$error":"#N/A"},{"$error":"#N/A"},{"$error":"#N/A"}]
["Markéta Paseková ","DZO",2,0,6,2,3,5,{"$f":"INDIRECT(CONCATENATE(\"Statistiky!C\",  MATCH(A29,Statistiky!$A$2:$A$71,0)+1))","v":{"$error":"#N/A"}},{"$f":"INDIRECT(CONCATENATE(\"Statistiky!D\",  MATCH(A29,Statistiky!$A$2:$A$71,0)+1))","v":{"$error":"#N/A"}},{"$error":"#N/A"},{"$error":"#N/A"},{"$error":"#N/A"}]
["Kamil Trhlík ","DZO",null,null,3,3,5,6,{"$f":"INDIRECT(CONCATENATE(\"Statistiky!C\",  MATCH(A30,Statistiky!$A$2:$A$71,0)+1))","v":{"$error":"#N/A"}},{"$f":"INDIRECT(CONCATENATE(\"Statistiky!D\",  MATCH(A30,Statistiky!$A$2:$A$71,0)+1))","v":{"$error":"#N/A"}},{"$error":"#N/A"},{"$error":"#N/A"},{"$error":"#N/A"}]
["Jana Navrátilová","DEW",2,4,2,1,1,4,{"$f":"INDIRECT(CONCATENATE(\"Statistiky!C\",  MATCH(A31,Statistiky!$A$2:$A$71,0)+1))","v":{"$error":"#N/A"}},{"$f":"INDIRECT(CONCATENATE(\"Statistiky!D\",  MATCH(A31,Statistiky!$A$2:$A$71,0)+1))","v":{"$error":"#N/A"}},{"$error":"#N/A"},{"$error":"#N/A"},{"$error":"#N/A"}]
["Barták Jaroslav","HIG",7,9,0,0,null,null,{"$f":"INDIRECT(CONCATENATE(\"Statistiky!C\",  MATCH(A32,Statistiky!$A$2:$A$71,0)+1))","v":{"$error":"#N/A"}},{"$f":"INDIRECT(CONCATENATE(\"Statistiky!D\",  MATCH(A32,Statistiky!$A$2:$A$71,0)+1))","v":{"$error":"#N/A"}},{"$error":"#N/A"},{"$error":"#N/A"},{"$error":"#N/A"}]
["Marek Spružina","ORL",5,3,4,2,null,null,{"$f":"INDIRECT(CONCATENATE(\"Statistiky!C\",  MATCH(A33,Statistiky!$A$2:$A$71,0)+1))","v":{"$error":"#N/A"}},{"$f":"INDIRECT(CONCATENATE(\"Statistiky!D\",  MATCH(A33,Statistiky!$A$2:$A$71,0)+1))","v":{"$error":"#N/A"}},{"$error":"#N/A"},{"$error":"#N/A"},{"$error":"#N/A"}]
["Magdaléna Dudáková","DEW",2,3,0,0,2,1,{"$f":"INDIRECT(CONCATENATE(\"Statistiky!C\",  MATCH(A34,Statistiky!$A$2:$A$71,0)+1))","v":{"$error":"#N/A"}},{"$f":"INDIRECT(CONCATENATE(\"Statistiky!D\",  MATCH(A34,Statistiky!$A$2:$A$71,0)+1))","v":{"$error":"#N/A"}},{"$error":"#N/A"},{"$error":"#N/A"},{"$error":"#N/A"}]
["Vlastislav Novák","ORL",1,2,1,7,1,1,{"$f":"INDIRECT(CONCATENATE(\"Statistiky!C\",  MATCH(A35,Statistiky!$A$2:$A$71,0)+1))","v":{"$error":"#N/A"}},{"$f":"INDIRECT(CONCATENATE(\"Statistiky!D\",  MATCH(A35,Statistiky!$A$2:$A$71,0)+1))","v":{"$error":"#N/A"}},{"$error":"#N/A"},{"$error":"#N/A"},{"$error":"#N/A"}]
["Martin Kožej","ORL",0,4,2,5,0,1,{"$f":"INDIRECT(CONCATENATE(\"Statistiky!C\",  MATCH(A36,Statistiky!$A$2:$A$71,0)+1))","v":{"$error":"#N/A"}},{"$f":"INDIRECT(CONCATENATE(\"Statistiky!D\",  MATCH(A36,Statistiky!$A$2:$A$71,0)+1))","v":{"$error":"#N/A"}},{"$error":"#N/A"},{"$error":"#N/A"},{"$error":"#N/A"}]
["Jakub Krejčí","WAR",7,2,0,0,null,null,{"$f":"INDIRECT(CONCATENATE(\"Statistiky!C\",  MATCH(A37,Statistiky!$A$2:$A$71,0)+1))","v":{"$error":"#N/A"}},{"$f":"INDIRECT(CONCATENATE(\"Statistiky!D\",  MATCH(A37,Statistiky!$A$2:$A$71,0)+1))","v":{"$error":"#N/A"}},{"$error":"#N/A"},{"$error":"#N/A"},{"$error":"#N/A"}]
["Jan Hanák","DEW",null,null,4,0,null,null,{"$f":"INDIRECT(CONCATENATE(\"Statistiky!C\",  MATCH(A38,Statistiky!$A$2:$A$71,0)+1))","v":{"$error":"#N/A"}},{"$f":"INDIRECT(CONCATENATE(\"Statistiky!D\",  MATCH(A38,Statistiky!$A$2:$A$71,0)+1))","v":{"$error":"#N/A"}},{"$error":"#N/A"},{"$error":"#N/A"},{"$error":"#N/A"}]
["Giesel Libor","HIG",null,null,2,7,null,null,{"$f":"INDIRECT(CONCATENATE(\"Statistiky!C\",  MATCH(A39,Statistiky!$A$2:$A$71,0)+1))","v":{"$error":"#N/A"}},{"$f":"INDIRECT(CONCATENATE(\"Statistiky!D\",  MATCH(A39,Statistiky!$A$2:$A$71,0)+1))","v":{"$error":"#N/A"}},{"$error":"#N/A"},{"$error":"#N/A"},{"$error":"#N/A"}]
["Marek Řihák","WAR",null,null,5,2,null,null,{"$f":"INDIRECT(CONCATENATE(\"Statistiky!C\",  MATCH(A40,Statistiky!$A$2:$A$71,0)+1))","v":{"$error":"#N/A"}},{"$f":"INDIRECT(CONCATENATE(\"Statistiky!D\",  MATCH(A40,Statistiky!$A$2:$A$71,0)+1))","v":{"$error":"#N/A"}},{"$error":"#N/A"},{"$error":"#N/A"},{"$error":"#N/A"}]
["Lenka Leciánová","DEW",1,2,1,0,1,0,{"$f":"INDIRECT(CONCATENATE(\"Statistiky!C\",  MATCH(A41,Statistiky!$A$2:$A$71,0)+1))","v":{"$error":"#N/A"}},{"$f":"INDIRECT(CONCATENATE(\"Statistiky!D\",  MATCH(A41,Statistiky!$A$2:$A$71,0)+1))","v":{"$error":"#N/A"}},{"$error":"#N/A"},{"$error":"#N/A"},{"$error":"#N/A"}]
["Kristen Miloslav","HIG",3,2,0,0,null,null,{"$f":"INDIRECT(CONCATENATE(\"Statistiky!C\",  MATCH(A42,Statistiky!$A$2:$A$71,0)+1))","v":{"$error":"#N/A"}},{"$f":"INDIRECT(CONCATENATE(\"Statistiky!D\",  MATCH(A42,Statistiky!$A$2:$A$71,0)+1))","v":{"$error":"#N/A"}},{"$error":"#N/A"},{"$error":"#N/A"},{"$error":"#N/A"}]
["Martin Ondroušek ","DZO",null,null,2,3,null,null,{"$f":"INDIRECT(CONCATENATE(\"Statistiky!C\",  MATCH(A43,Statistiky!$A$2:$A$71,0)+1))","v":{"$error":"#N/A"}},{"$f":"INDIRECT(CONCATENATE(\"Statistiky!D\",  MATCH(A43,Statistiky!$A$2:$A$71,0)+1))","v":{"$error":"#N/A"}},{"$error":"#N/A"},{"$error":"#N/A"},{"$error":"#N/A"}]
["Lukáš Trubač","DEW",null,null,1,1,1,2,{"$f":"INDIRECT(CONCATENATE(\"Statistiky!C\",  MATCH(A44,Statistiky!$A$2:$A$71,0)+1))","v":{"$error":"#N/A"}},{"$f":"INDIRECT(CONCATENATE(\"Statistiky!D\",  MATCH(A44,Statistiky!$A$2:$A$71,0)+1))","v":{"$error":"#N/A"}},{"$error":"#N/A"},{"$error":"#N/A"},{"$error":"#N/A"}]
["Moláček Karel","HIG",0,1,0,4,null,null,{"$f":"INDIRECT(CONCATENATE(\"Statistiky!C\",  MATCH(A45,Statistiky!$A$2:$A$71,0)+1))","v":{"$error":"#N/A"}},{"$f":"INDIRECT(CONCATENATE(\"Statistiky!D\",  MATCH(A45,Statistiky!$A$2:$A$71,0)+1))","v":{"$error":"#N/A"}},{"$error":"#N/A"},{"$error":"#N/A"},{"$error":"#N/A"}]
["Miroslav Holeček","WAR",0,2,0,3,null,null,{"$f":"INDIRECT(CONCATENATE(\"Statistiky!C\",  MATCH(A46,Statistiky!$A$2:$A$71,0)+1))","v":{"$error":"#N/A"}},{"$f":"INDIRECT(CONCATENATE(\"Statistiky!D\",  MATCH(A46,Statistiky!$A$2:$A$71,0)+1))","v":{"$error":"#N/A"}},{"$error":"#N/A"},{"$error":"#N/A"},{"$error":"#N/A"}]
["Jan Valášek","DZO",null,null,0,0,3,1,{"$f":"INDIRECT(CONCATENATE(\"Statistiky!C\",  MATCH(A47,Statistiky!$A$2:$A$71,0)+1))","v":{"$error":"#N/A"}},{"$f":"INDIRECT(CONCATENATE(\"Statistiky!D\",  MATCH(A47,Statistiky!$A$2:$A$71,0)+1))","v":{"$error":"#N/A"}},{"$error":"#N/A"},{"$error":"#N/A"},{"$error":"#N/A"}]
["Pavla Hanskutová","DEW",null,null,2,2,null,null,{"$f":"INDIRECT(CONCATENATE(\"Statistiky!C\",  MATCH(A48,Statistiky!$A$2:$A$71,0)+1))","v":{"$error":"#N/A"}},{"$f":"INDIRECT(CONCATENATE(\"Statistiky!D\",  MATCH(A48,Statistiky!$A$2:$A$71,0)+1))","v":{"$error":"#N/A"}},{"$error":"#N/A"},{"$error":"#N/A"},{"$error":"#N/A"}]
["Martina Bílková","WAR",0,2,0,1,null,null,{"$f":"INDIRECT(CONCATENATE(\"Statistiky!C\",  MATCH(A49,Statistiky!$A$2:$A$71,0)+1))","v":{"$error":"#N/A"}},{"$f":"INDIRECT(CONCATENATE(\"Statistiky!D\",  MATCH(A49,Statistiky!$A$2:$A$71,0)+1))","v":{"$error":"#N/A"}},{"$error":"#N/A"},{"$error":"#N/A"},{"$error":"#N/A"}]
["Radek Suchomel ","DEW",1,1,0,0,null,null,{"$f":"INDIRECT(CONCATENATE(\"Statistiky!C\",  MATCH(A50,Statistiky!$A$2:$A$71,0)+1))","v":{"$error":"#N/A"}},{"$f":"INDIRECT(CONCATENATE(\"Statistiky!D\",  MATCH(A50,Statistiky!$A$2:$A$71,0)+1))","v":{"$error":"#N/A"}},{"$error":"#N/A"},{"$error":"#N/A"},{"$error":"#N/A"}]
["Alice Svobodová","DEW",null,null,0,0,1,0,{"$f":"INDIRECT(CONCATENATE(\"Statistiky!C\",  MATCH(A51,Statistiky!$A$2:$A$71,0)+1))","v":{"$error":"#N/A"}},{"$f":"INDIRECT(CONCATENATE(\"Statistiky!D\",  MATCH(A51,Statistiky!$A$2:$A$71,0)+1))","v":{"$error":"#N/A"}},{"$error":"#N/A"},{"$error":"#N/A"},{"$error":"#N/A"}]
["Lucie Mrusková","ORL",0,1,0,0,null,null,{"$f":"INDIRECT(CONCATENATE(\"Statistiky!C\",  MATCH(A52,Statistiky!$A$2:$A$71,0)+1))","v":{"$error":"#N/A"}},{"$f":"INDIRECT(CONCATENATE(\"Statistiky!D\",  MATCH(A52,Statistiky!$A$2:$A$71,0)+1))","v":{"$error":"#N/A"}},{"$error":"#N/A"},{"$error":"#N/A"},{"$error":"#N/A"}]
["Trlíková Martina","DEW",0,1,0,0,null,null,{"$f":"INDIRECT(CONCATENATE(\"Statistiky!C\",  MATCH(A53,Statistiky!$A$2:$A$71,0)+1))","v":{"$error":"#N/A"}},{"$f":"INDIRECT(CONCATENATE(\"Statistiky!D\",  MATCH(A53,Statistiky!$A$2:$A$71,0)+1))","v":{"$error":"#N/A"}},{"$error":"#N/A"},{"$error":"#N/A"},{"$error":"#N/A"}]
["Ondra Lukáš","DEW",{"$nulls":4},0,1,{"$f":"INDIRECT(CONCATENATE(\"Statistiky!C\",  MATCH(A54,Statistiky!$A$2:$A$71,0)+1))","v":{"$error":"#N/A"}},{"$f":"INDIRECT(CONCATENATE(\"Statistiky!D\",  MATCH(A54,Statistiky!$A$2:$A$71,0)+1))","v":{"$error":"#N/A"}},{"$error":"#N/A"},{"$error":"#N/A"},{"$error":"#N/A"}]
["Lenka Podjuklová","ORL",null,null,0,0,null,null,{"$f":"INDIRECT(CONCATENATE(\"Statistiky!C\",  MATCH(A55,Statistiky!$A$2:$A$71,0)+1))","v":{"$error":"#N/A"}},{"$f":"INDIRECT(CONCATENATE(\"Statistiky!D\",  MATCH(A55,Statistiky!$A$2:$A$71,0)+1))","v":{"$error":"#N/A"}},{"$error":"#N/A"},{"$error":"#N/A"},{"$error":"#N/A"}]
["Amy Hein","DEW",null,null,0,0,null,null,{"$f":"INDIRECT(CONCATENATE(\"Statistiky!C\",  MATCH(A56,Statistiky!$A$2:$A$71,0)+1))","v":{"$error":"#N/A"}},{"$f":"INDIRECT(CONCATENATE(\"Statistiky!D\",  MATCH(A56,Statistiky!$A$2:$A$71,0)+1))","v":{"$error":"#N/A"}},{"$error":"#N/A"},{"$error":"#N/A"},{"$error":"#N/A"}]
["Diblík Štěpán","HIG",null,null,0,0,null,null,{"$f":"INDIRECT(CONCATENATE(\"Statistiky!C\",  MATCH(A57,Statistiky!$A$2:$A$71,0)+1))","v":{"$error":"#N/A"}},{"$f":"INDIRECT(CONCATENATE(\"Statistiky!D\",  MATCH(A57,Statistiky!$A$2:$A$71,0)+1))","v":{"$error":"#N/A"}},{"$error":"#N/A"},{"$error":"#N/A"},{"$error":"#N/A"}]
["Foltýnová N","DEW",null,null,0,0,null,null,{"$f":"INDIRECT(CONCATENATE(\"Statistiky!C\",  MATCH(A58,Statistiky!$A$2:$A$71,0)+1))","v":{"$error":"#N/A"}},{"$f":"INDIRECT(CONCATENATE(\"Statistiky!D\",  MATCH(A58,Statistiky!$A$2:$A$71,0)+1))","v":{"$error":"#N/A"}},{"$error":"#N/A"},{"$error":"#N/A"},{"$error":"#N/A"}]
["Jan Kotek","WAR",null,null,0,0,null,null,{"$f":"INDIRECT(CONCATENATE(\"Statistiky!C\",  MATCH(A59,Statistiky!$A$2:$A$71,0)+1))","v":{"$error":"#N/A"}},{"$f":"INDIRECT(CONCATENATE(\"Statistiky!D\",  MATCH(A59,Statistiky!$A$2:$A$71,0)+1))","v":{"$error":"#N/A"}},{"$error":"#N/A"},{"$error":"#N/A"},{"$error":"#N/A"}]
["Lenka Horáková","DEW",null,null,0,0,null,null,{"$f":"INDIRECT(CONCATENATE(\"Statistiky!C\",  MATCH(A60,Statistiky!$A$2:$A$71,0)+1))","v":{"$error":"#N/A"}},{"$f":"INDIRECT(CONCATENATE(\"Statistiky!D\",  MATCH(A60,Statistiky!$A$2:$A$71,0)+1))","v":{"$error":"#N/A"}},{"$error":"#N/A"},{"$error":"#N/A"},{"$error":"#N/A"}]
["Michaela Jurinová","DEW",null,null,0,0,null,null,{"$f":"INDIRECT(CONCATENATE(\"Statistiky!C\",  MATCH(A61,Statistiky!$A$2:$A$71,0)+1))","v":{"$error":"#N/A"}},{"$f":"INDIRECT(CONCATENATE(\"Statistiky!D\",  MATCH(A61,Statistiky!$A$2:$A$71,0)+1))","v":{"$error":"#N/A"}},{"$error":"#N/A"},{"$error":"#N/A"},{"$error":"#N/A"}]
["Natálie Maixnerová","DEW",null,null,0,0,null,null,{"$f":"INDIRECT(CONCATENATE(\"Statistiky!C\",  MATCH(A62,Statistiky!$A$2:$A$71,0)+1))","v":{"$error":"#N/A"}},{"$f":"INDIRECT(CONCATENATE(\"Statistiky!D\",  MATCH(A62,Statistiky!$A$2:$A$71,0)+1))","v":{"$error":"#N/A"}},{"$error":"#N/A"},{"$error":"#N/A"},{"$error":"#N/A"}]
["Ondřej Přikryl ","DZO",null,null,0,0,null,null,{"$f":"INDIRECT(CONCATENATE(\"Statistiky!C\",  MATCH(A63,Statistiky!$A$2:$A$71,0)+1))","v":{"$error":"#N/A"}},{"$f":"INDIRECT(CONCATENATE(\"Statistiky!D\",  MATCH(A63,Statistiky!$A$2:$A$71,0)+1))","v":{"$error":"#N/A"}},{"$error":"#N/A"},{"$error":"#N/A"},{"$error":"#N/A"}]
["Radim Svatoš","ORL",null,null,0,0,null,null,{"$f":"INDIRECT(CONCATENATE(\"Statistiky!C\",  MATCH(A64,Statistiky!$A$2:$A$71,0)+1))","v":{"$error":"#N/A"}},{"$f":"INDIRECT(CONCATENATE(\"Statistiky!D\",  MATCH(A64,Statistiky!$A$2:$A$71,0)+1))","v":{"$error":"#N/A"}},{"$error":"#N/A"},{"$error":"#N/A"},{"$error":"#N/A"}]
["Roman Skýba","ORL",null,null,0,0,null,null,{"$f":"INDIRECT(CONCATENATE(\"Statistiky!C\",  MATCH(A65,Statistiky!$A$2:$A$71,0)+1))","v":{"$error":"#N/A"}},{"$f":"INDIRECT(CONCATENATE(\"Statistiky!D\",  MATCH(A65,Statistiky!$A$2:$A$71,0)+1))","v":{"$error":"#N/A"}},{"$error":"#N/A"},{"$error":"#N/A"},{"$error":"#N/A"}]
["Stachoňová M","DEW",null,null,0,0,null,null,{"$f":"INDIRECT(CONCATENATE(\"Statistiky!C\",  MATCH(A66,Statistiky!$A$2:$A$71,0)+1))","v":{"$error":"#N/A"}},{"$f":"INDIRECT(CONCATENATE(\"Statistiky!D\",  MATCH(A66,Statistiky!$A$2:$A$71,0)+1))","v":{"$error":"#N/A"}},{"$error":"#N/A"},{"$error":"#N/A"},{"$error":"#N/A"}]
["Václav Večeřa","ORL",null,null,0,0,null,null,{"$f":"INDIRECT(CONCATENATE(\"Statistiky!C\",  MATCH(A67,Statistiky!$A$2:$A$71,0)+1))","v":{"$error":"#N/A"}},{"$f":"INDIRECT(CONCATENATE(\"Statistiky!D\",  MATCH(A67,Statistiky!$A$2:$A$71,0)+1))","v":{"$error":"#N/A"}},{"$f":"C67+E67+G67+I67","v":{"$error":"#N/A"}},{"$f":"D67+F67+H67+J67","v":{"$error":"#N/A"}},{"$f":"K67+L67","v":{"$error":"#N/A"}}]