{"text_format":"3","workbook":"xlsx","n_sheets":15,"sheets":["Tabulky","Zápisy","RozpisS","Rozpis","Tabulka","Statistiky","BCI","LOW","BOB","DEM","T5","T6","T7","T8","CELKEM"],"not_rendered":{"macros":1,"defined_names":2},"read":"whole","date_system":"1900"}

{"sheet":"Tabulky","index":0,"n_rows":13,"n_cols":8,"rows_kept":13}
[null,"BCI","LOW","BOB","DEM"," skóre","body","pořadí"]
["A1 BCI","X","2:17","1:19","12:1","15:37","2","3"]
["A2 LOW","17:2","X","11:12","22:0","50:14","4","2"]
["A3 BOB","19:1","12:11","X","25:1","56:13","6","1"]
["A4 DEM","1:12","0:22","1:25","X","2:59","0","4"]
[]
["zápasy:"]
["09:30:00","A1:A2","BCI","2:17","LOW"]
{"$rows_left_out":6}
{"sheet":"Zápisy","index":1,"n_rows":33,"n_cols":22,"rows_kept":33,"merged":[[0,0,0,1],[0,2,1,4],[0,5,1,5],[0,6,0,7],[0,8,1,10],[0,13,1,15],[1,0,1,1],[1,6,1,7],[2,13,3,14],[8,13,9,14],[14,13,14,15],[25,1,26,2],[25,3,26,4],[25,7,26,8],[25,9,26,10],[28,1,29,2],[28,3,29,4],[28,7,29,8],[28,9,29,10],[28,13,29,15],[31,1,32,2],[31,3,32,4],[31,7,32,8],[31,9,32,10],[31,13,32,15]]}
["Domácí",null,{"$f":"INDEX(R4:R11,T3,1)","v":"Bobři"},null,null,":","Hosté",null,{"$f":"INDEX(R4:R11,U3,1)","v":"Démoni"},{"$nulls":4},"ÚSPĚŠNÉ zásahy brankařů"]
["BOB",{"$nulls":5},"DEM"]
["#","i","jméno","góly","náhry","stav","#","i","jméno","góly","náhry","stav",null,{"$f":"A2","v":"BOB"},{"$nulls":3},"týmy","kódy",{"$f":"SUM(T4:T11)","v":3},{"$f":"SUM(U4:U11)","v":4},"radek"]
[{"$f":"IF(\"\"<>INDIRECT(ADDRESS(3+$V4,3,,,$A$2)),INDIRECT(ADDRESS(3+$V4,3,,,$A$2)),\"\")","v":10},{"$f":"IF(\"\"<>INDIRECT(ADDRESS(3+$V4,1,,,$A$2)),INDIRECT(ADDRESS(3+$V4,1,,,$A$2)),\"\")","v":""},{"$f":"IF(\"\"<>INDIRECT(ADDRESS(3+$V4,2,,,$A$2)),INDIRECT(ADDRESS(3+$V4,2,,,$A$2)),\"\")","v":"Eliáš Mesany"},null,null,":",{"$f":"IF(\"\"<>INDIRECT(ADDRESS(3+$V4,3,,,$G$2)),INDIRECT(ADDRESS(3+$V4,3,,,$G$2)),\"\")","v":6},{"$f":"IF(\"\"<>INDIRECT(ADDRESS(3+$V4,1,,,$G$2)),INDIRECT(ADDRESS(3+$V4,1,,,$G$2)),\"\")","v":"B"},{"$f":"IF(\"\"<>INDIRECT(ADDRESS(3+$V4,2,,,$G$2)),INDIRECT(ADDRESS(3+$V4,2,,,$G$2)),\"\")","v":"Hofmanová Lenka"},null,null,":",{"$nulls":5},{"$f":"BCI!B1","v":"Bobříci"},{"$f":"BCI!B2","v":"BCI"},{"$f":"IF($A$2=S4,1,\"\")","v":""},{"$f":"IF($G$2=S4,1,\"\")","v":""},1]
[6,"b","Vojtěch Procházka",null,null,":",30,"","Fulín David *",null,null,":",{"$nulls":5},{"$f":"LOW!B1","v":"Lowlander Zábřeh"},{"$f":"LOW!B2","v":"LOW"},{"$f":"IF($A$2=S5,2,\"\")","v":""},{"$f":"IF($G$2=S5,2,\"\")","v":""},2]
[7,"","Matyáš Dolenský",null,null,":",7,"","Krejčovská Michaela *",null,null,":",{"$nulls":5},{"$f":"BOB!B1","v":"Bobři"},{"$f":"BOB!B2","v":"BOB"},{"$f":"IF($A$2=S6,3,\"\")","v":3},{"$f":"IF($G$2=S6,3,\"\")","v":""},3]
[3,"","Kryštof Abel",null,null,":",31,"","Adámek Albert *",null,null,":",{"$nulls":5},{"$f":"DEM!B1","v":"Démoni"},{"$f":"DEM!B2","v":"DEM"},{"$f":"IF($A$2=S7,4,\"\")","v":""},{"$f":"IF($G$2=S7,4,\"\")","v":4},4]
[4,"","Emil Hejda",null,null,":",10,"","Sejková Berenika *",null,null,":",{"$nulls":7},{"$f":"IF($A$2=S8,5,\"\")","v":""},{"$f":"IF($G$2=S8,5,\"\")","v":""},5]
{"$rows_left_out":26}
{"sheet":"RozpisS","index":2,"n_rows":43,"n_cols":21,"rows_kept":43,"hidden":true,"merged":[[0,0,0,1],[0,2,1,4],[0,5,1,5],[0,6,0,7],[0,8,1,10],[0,12,2,14],[1,0,1,1],[1,6,1,7],[3,12,4,14],[9,12,10,14],[16,12,17,14],[35,1,36,2],[35,3,36,4],[35,7,36,8],[35,9,36,10],[35,12,36,14],[38,1,39,2],[38,3,39,4],[38,7,39,8],[38,9,39,10],[38,12,39,14],[41,1,42,2],[41,3,42,4],[41,7,42,8],[41,9,42,10]]}
["Domácí",null,{"$f":"INDEX(Q4:Q11,S3,1)","v":{"$error":"#VALUE!"}},null,null,":","Hosté",null,{"$f":"INDEX(Q4:Q11,T3,1)","v":{"$error":"#VALUE!"}},{"$nulls":3},"ÚSPĚŠNÉ ZÁSAHY BRANKAŘU"]
["HIG",{"$nulls":5},"FAB"]
["#","i","jméno","góly","náhry","stav","#","i","jméno","góly","náhry",{"$nulls":5},"týmy","kódy",{"$f":"SUM(S4:S11)","v":0},{"$f":"SUM(T4:T11)","v":0},"radek"]
[{"$f":"IF(\"\"<>INDIRECT(ADDRESS(3+$U4,3,,,$A$2)),INDIRECT(ADDRESS(3+$U4,3,,,$A$2)),\"\")","v":{"$error":"#REF!"}},{"$f":"IF(\"\"<>INDIRECT(ADDRESS(3+$U4,1,,,$A$2)),INDIRECT(ADDRESS(3+$U4,1,,,$A$2)),\"\")","v":{"$error":"#REF!"}},{"$f":"IF(\"\"<>INDIRECT(ADDRESS(3+$U4,2,,,$A$2)),INDIRECT(ADDRESS(3+$U4,2,,,$A$2)),\"\")","v":{"$error":"#REF!"}},null,null,":",{"$f":"IF(\"\"<>INDIRECT(ADDRESS(3+$U4,3,,,$G$2)),INDIRECT(ADDRESS(3+$U4,3,,,$G$2)),\"\")","v":{"$error":"#REF!"}},{"$f":"IF(\"\"<>INDIRECT(ADDRESS(3+$U4,1,,,$G$2)),INDIRECT(ADDRESS(3+$U4,1,,,$G$2)),\"\")","v":{"$error":"#REF!"}},{"$f":"IF(\"\"<>INDIRECT(ADDRESS(3+$U4,2,,,$G$2)),INDIRECT(ADDRESS(3+$U4,2,,,$G$2)),\"\")","v":{"$error":"#REF!"}},{"$nulls":3},{"$f":"A2","v":"HIG"},{"$nulls":3},{"$f":"BOB!B1","v":"Bobři"},{"$f":"BOB!B2","v":"BOB"},{"$f":"IF($A$2=R4,1,\"\")","v":""},{"$f":"IF($G$2=R4,1,\"\")","v":""},1]
[{"$f":"IF(\"\"<>INDIRECT(ADDRESS(3+$U5,3,,,$A$2)),INDIRECT(ADDRESS(3+$U5,3,,,$A$2)),\"\")","v":{"$error":"#REF!"}},{"$f":"IF(\"\"<>INDIRECT(ADDRESS(3+$U5,1,,,$A$2)),INDIRECT(ADDRESS(3+$U5,1,,,$A$2)),\"\")","v":{"$error":"#REF!"}},{"$f":"IF(\"\"<>INDIRECT(ADDRESS(3+$U5,2,,,$A$2)),INDIRECT(ADDRESS(3+$U5,2,,,$A$2)),\"\")","v":{"$error":"#REF!"}},null,null,":",{"$f":"IF(\"\"<>INDIRECT(ADDRESS(3+$U5,3,,,$G$2)),INDIRECT(ADDRESS(3+$U5,3,,,$G$2)),\"\")","v":{"$error":"#REF!"}},{"$f":"IF(\"\"<>INDIRECT(ADDRESS(3+$U5,1,,,$G$2)),INDIRECT(ADDRESS(3+$U5,1,,,$G$2)),\"\")","v":{"$error":"#REF!"}},{"$f":"IF(\"\"<>INDIRECT(ADDRESS(3+$U5,2,,,$G$2)),INDIRECT(ADDRESS(3+$U5,2,,,$G$2)),\"\")","v":{"$error":"#REF!"}},{"$nulls":7},{"$f":"LOW!B1","v":"Lowlander Zábřeh"},{"$f":"LOW!B2","v":"LOW"},{"$f":"IF($A$2=R5,2,\"\")","v":""},{"$f":"IF($G$2=R5,2,\"\")","v":""},2]
[{"$error":"#REF!"},{"$error":"#REF!"},{"$error":"#REF!"},null,null,":",{"$error":"#REF!"},{"$error":"#REF!"},{"$error":"#REF!"},{"$nulls":7},{"$f":"BCI!B1","v":"Bobříci"},{"$f":"BCI!B2","v":"BCI"},{"$f":"IF($A$2=R6,3,\"\")","v":""},{"$f":"IF($G$2=R6,3,\"\")","v":""},3]
[{"$error":"#REF!"},{"$error":"#REF!"},{"$error":"#REF!"},null,null,":",{"$error":"#REF!"},{"$error":"#REF!"},{"$error":"#REF!"},{"$nulls":7},{"$f":"'T5'!B1","v":"T5"},{"$f":"'T5'!B2","v":"T5"},{"$f":"IF($A$2=R7,4,\"\")","v":""},{"$f":"IF($G$2=R7,4,\"\")","v":""},4]
[{"$error":"#REF!"},{"$error":"#REF!"},{"$error":"#REF!"},null,null,":",{"$error":"#REF!"},{"$error":"#REF!"},{"$error":"#REF!"},{"$nulls":7},{"$f":"DEM!B1","v":"Démoni"},{"$f":"DEM!B2","v":"DEM"},{"$f":"IF($A$2=R8,5,\"\")","v":""},{"$f":"IF($G$2=R8,5,\"\")","v":""},5]
{"$rows_left_out":36}
{"sheet":"Rozpis","index":3,"n_rows":32,"n_cols":18,"rows_kept":32,"hidden":true,"merged":[[15,9,37,11],[30,0,30,7]]}
["sobota 18.6.",{"$nulls":8},"muži","Iktočante","IKT",1,"2*25","Matěj Melichar","matej.melichar@seznam.cz"]
["ČAS","Hřiště",{"$nulls":4},"Hosté","píská",null,null,"Refugees","RFG",4,null,"Matzáš Jurkovič","Matyasjurkovic@gmail.com"]
["10:00:00","A","Refugees",null,":",null,"Bobři","HIG","4-3",null,"Bobři","BOB",3,null,"Staněk Ondřej","ondra02.stanek@seznam.cz","Guma","j.veit@volny.cz"]
[null,"B","Fabiánky Strašice",null,":",null,"Trilobit beta","PAK","4-1",null,"Highlander Zábřeh","HIG",5]
["11:00:00","A","Tyšunky",null,":",null,"Paka","FBZ","3-2",null,"Fabiáni Strašice","FAB",2,null,"Pavel Bůcha","bucha.p@seznam.cz","Pavel Bůcha"]
[null,"B","Bobříci",null,":",null,"Lowlander Zábřeh","RFG","4-1","ženy","Fabiánky Strašice","FBZ",1,"2*20","Věra","vera.silhanova@post.cz"]
["12:00:00","A","Highlander Zábřeh",null,":",null,"Fabiáni Strašice","IKT","5-2",null,"Trilobit beta","TRI",4,null,"Barbora Vykouková","vykouk.ba@gmail.com"]
[null,"B","Wallowa",null,":",null,"Stopaři","BOB","3-2",null,"Tyšunky","TYS",2,null,"Olina Hilgartová Zýková","zykova.o@gmail.com","Drnková Veronika","drnkova@gmail.com"]
{"$rows_left_out":25}
{"sheet":"Tabulka","index":4,"n_rows":20,"n_cols":9,"rows_kept":20,"hidden":true}
["MUŽI (M)",{"$f":"Rozpis!L1","v":"IKT"},{"$f":"Rozpis!L2","v":"RFG"},{"$f":"Rozpis!L3","v":"BOB"},{"$f":"Rozpis!L4","v":"HIG"},{"$f":"Rozpis!L5","v":"FAB"},"Skóre","Body","Pořadí"]
[{"$f":"Rozpis!K1","v":"Iktočante"},"X",":",":",":",":"]
[{"$f":"Rozpis!K2","v":"Refugees"},":","X",":",":",":"]
[{"$f":"Rozpis!K3","v":"Bobři"},":",":","X",":",":"]
[{"$f":"Rozpis!K4","v":"Highlander Zábřeh"},":",":",":","X",":"]
[{"$f":"Rozpis!K5","v":"Fabiáni Strašice"},":",":",":",":","X"]
[]
[]
{"$rows_left_out":13}
{"sheet":"Statistiky","index":5,"n_rows":181,"n_cols":8,"rows_kept":181}
["jméno","tým","góly","nahrávky","kanada","tresty","úsp. bran.","ucastnik"]
[{"$f":"BOB!B9","v":"Jonáš Vodňanský"},{"$f":"BOB!$B$2","v":"BOB"},{"$f":"BOB!P9","v":15},{"$f":"BOB!Q9","v":9},{"$f":"C2+D2","v":24},{"$f":"BOB!AI9","v":0},{"$f":"BOB!AH9","v":{"v":0,"d":"0.00"}},{"$f":"CONCATENATE(IF(E2>0,1,IF(G2>0,2,IF(F2>0,3,\"\"))),IF(A2=0,\"žžž\",A2))","v":"1Jonáš Vodňanský"}]
[{"$f":"BOB!B7","v":"Kryštof Abel"},{"$f":"BOB!$B$2","v":"BOB"},{"$f":"BOB!P7","v":6},{"$f":"BOB!Q7","v":14},{"$f":"C3+D3","v":20},{"$f":"BOB!AI7","v":2},{"$f":"BOB!AH7","v":{"v":0,"d":"0.00"}},{"$f":"CONCATENATE(IF(E3>0,1,IF(G3>0,2,IF(F3>0,3,\"\"))),IF(A3=0,\"žžž\",A3))","v":"1Kryštof Abel"}]
[{"$f":"BOB!B6","v":"Matyáš Dolenský"},{"$f":"BOB!$B$2","v":"BOB"},{"$f":"BOB!P6","v":12},{"$f":"BOB!Q6","v":7},{"$f":"C4+D4","v":19},{"$f":"BOB!AI6","v":0},{"$f":"BOB!AH6","v":{"v":0,"d":"0.00"}},{"$f":"CONCATENATE(IF(E4>0,1,IF(G4>0,2,IF(F4>0,3,\"\"))),IF(A4=0,\"žžž\",A4))","v":"1Matyáš Dolenský"}]
[{"$f":"LOW!B5","v":"Jakub Holinka"},{"$f":"LOW!$B$2","v":"LOW"},{"$f":"LOW!P5","v":16},{"$f":"LOW!Q5","v":1},{"$f":"C5+D5","v":17},{"$f":"LOW!AI5","v":0},{"$f":"LOW!AH5","v":{"v":100,"d":"100.00"}},{"$f":"CONCATENATE(IF(E5>0,1,IF(G5>0,2,IF(F5>0,3,\"\"))),IF(A5=0,\"žžž\",A5))","v":"1Jakub Holinka"}]
[{"$f":"BOB!B8","v":"Emil Hejda"},{"$f":"BOB!$B$2","v":"BOB"},{"$f":"BOB!P8","v":15},{"$f":"BOB!Q8","v":2},{"$f":"C6+D6","v":17},{"$f":"BOB!AI8","v":0},{"$f":"BOB!AH8","v":{"v":0,"d":"0.00"}},{"$f":"CONCATENATE(IF(E6>0,1,IF(G6>0,2,IF(F6>0,3,\"\"))),IF(A6=0,\"žžž\",A6))","v":"1Emil Hejda"}]
[{"$f":"LOW!B6","v":"Hynek Matura"},{"$f":"LOW!$B$2","v":"LOW"},{"$f":"LOW!P6","v":11},{"$f":"LOW!Q6","v":6},{"$f":"C7+D7","v":17},{"$f":"LOW!AI6","v":0},{"$f":"LOW!AH6","v":{"v":0,"d":"0.00"}},{"$f":"CONCATENATE(IF(E7>0,1,IF(G7>0,2,IF(F7>0,3,\"\"))),IF(A7=0,\"žžž\",A7))","v":"1Hynek Matura"}]
[{"$f":"BOB!B4","v":"Eliáš Mesany"},{"$f":"BOB!$B$2","v":"BOB"},{"$f":"BOB!P4","v":7},{"$f":"BOB!Q4","v":9},{"$f":"C8+D8","v":16},{"$f":"BOB!AI4","v":0},{"$f":"BOB!AH4","v":{"v":0,"d":"0.00"}},{"$f":"CONCATENATE(IF(E8>0,1,IF(G8>0,2,IF(F8>0,3,\"\"))),IF(A8=0,\"žžž\",A8))","v":"1Eliáš Mesany"}]
{"$rows_left_out":174}
{"sheet":"BCI","index":6,"n_rows":33,"n_cols":37,"rows_kept":33}
["název","Bobříci","Bodovani","Z1",null,"Z2",null,"Z3",null,"Z4",null,"Z5",null,"Z6",null,"CEL",null,null,"Brankaři","Z1",null,"Z2",null,"Z3",null,"Z4",null,"Z5",null,"Z6",null,"CEL",null,null,"Tresty"]
["kód","BCI",null,"G","N","G","N","G","N","G","N","G","N","G","N","G","N","K",null,"Z","G","Z","G","Z","G","Z","G","Z","G","Z","G","Z","G","%","min celk."]
["info","Hráči","#"]
[null,"Josef Byška",{"$nulls":13},{"$f":"D4+F4+H4+J4+L4+N4","v":0},{"$f":"E4+G4+I4+K4+M4+O4","v":0},{"$f":"P4+Q4","v":0},{"$f":"IF(A4=\"B\",\"X\",\"\")","v":""},{"$nulls":12},{"$f":"T4+V4+X4+Z4+AB4+AD4","v":0},{"$f":"U4+W4+Y4+AA4+AC4+AE4","v":0},{"$f":"IF(AF4+AG4 < 1,0,AF4*100/(AF4+AG4))","v":{"v":0,"d":"0.00"}}]
[null,"Marco Bubela *",12,2,0,null,null,11,{"$nulls":7},{"$f":"D5+F5+H5+J5+L5+N5","v":13},{"$f":"E5+G5+I5+K5+M5+O5","v":0},{"$f":"P5+Q5","v":13},{"$f":"IF(A5=\"B\",\"X\",\"\")","v":""},{"$nulls":12},{"$f":"T5+V5+X5+Z5+AB5+AD5","v":0},{"$f":"U5+W5+Y5+AA5+AC5+AE5","v":0},{"$f":"IF(AF5+AG5 < 1,0,AF5*100/(AF5+AG5))","v":{"v":0,"d":"0.00"}},2]
[null,"Lada Procházková *",8,{"$nulls":12},0,0,0,"",{"$nulls":12},0,0,{"v":0,"d":"0.00"},2]
[null,"Vojtěch Kulič *",13,{"$nulls":12},0,0,0,"x",null,null,9,19,{"$nulls":8},9,19,{"v":32.142857142857146,"d":"32.14"},null,null,"Jiří Bidlo 5,"]
[null,"Vlášek Matěj",14,null,null,1,{"$nulls":9},1,0,1,"",{"$nulls":12},0,0,{"v":0,"d":"0.00"},null,null,"Vít Bidlo 22,"]
{"$rows_left_out":26}
{"sheet":"LOW","index":7,"n_rows":33,"n_cols":35,"rows_kept":33}
["název","Lowlander Zábřeh","Bodovani","Z1",null,"Z2",null,"Z3",null,"Z4",null,"Z5",null,"Z6",null,"CEL",null,null,"Brankaři","Z1",null,"Z2",null,"Z3",null,"Z4",null,"Z5",null,"Z6",null,"CEL",null,null,"Tresty"]
["kód","LOW",null,"G","N","G","N","G","N","G","N","G","N","G","N","G","N","K",null,"Z","G","Z","G","Z","G","Z","G","Z","G","Z","G","Z","G","%","min celk."]
["info","Hráči","#"]
[null,"Lubojacký Robert",3,null,null,1,2,null,1,{"$nulls":6},{"$f":"D4+F4+H4+J4+L4+N4","v":1},{"$f":"E4+G4+I4+K4+M4+O4","v":3},{"$f":"P4+Q4","v":4},"x",9,2,{"$nulls":10},{"$f":"T4+V4+X4+Z4+AB4+AD4","v":9},{"$f":"U4+W4+Y4+AA4+AC4+AE4","v":2},{"$f":"IF(AF4+AG4 < 1,0,AF4*100/(AF4+AG4))","v":{"v":81.81818181818181,"d":"81.82"}}]
[null,"Jakub Holinka",4,6,1,null,null,10,{"$nulls":7},{"$f":"D5+F5+H5+J5+L5+N5","v":16},{"$f":"E5+G5+I5+K5+M5+O5","v":1},{"$f":"P5+Q5","v":17},"x",null,null,10,0,{"$nulls":8},{"$f":"T5+V5+X5+Z5+AB5+AD5","v":10},0,{"$f":"IF(AF5+AG5 < 1,0,AF5*100/(AF5+AG5))","v":{"v":100,"d":"100.00"}}]
[null,"Hynek Matura",9,3,3,7,3,1,{"$nulls":7},11,6,17,{"$f":"IF(A6=\"B\",\"X\",\"\")","v":""},{"$nulls":12},0,0,{"v":0,"d":"0.00"}]
[null,"Václavek Filip",10,5,null,4,2,{"$nulls":8},9,2,11,"",{"$nulls":4},13,12,{"$nulls":6},13,12,{"v":52,"d":"52.00"}]
[null,"Jáchym Čech",13,1,5,3,3,null,4,{"$nulls":6},4,12,16,"",{"$nulls":12},0,0,{"v":0,"d":"0.00"}]
{"$rows_left_out":26}
{"sheet":"BOB","index":8,"n_rows":33,"n_cols":35,"rows_kept":33}
["název","Bobři","Bodovani","Z1",null,"Z2",null,"Z3",null,"Z4",null,"Z5",null,"Z6",null,"CEL",null,null,"Brankaři","Z1",null,"Z2",null,"Z3",null,"Z4",null,"Z5",null,"Z6",null,"CEL",null,null,"Tresty"]
["kód","BOB",null,"G","N","G","N","G","N","G","N","G","N","G","N","G","N","K",null,"Z","G","Z","G","Z","G","Z","G","Z","G","Z","G","Z","G","%","min celk."]
["info","Hráči","#"]
[null,"Eliáš Mesany",10,null,3,2,2,5,4,{"$nulls":6},{"$f":"D4+F4+H4+J4+L4+N4","v":7},{"$f":"E4+G4+I4+K4+M49+O4","v":9},{"$f":"P4+Q4","v":16},{"$nulls":13},{"$f":"T4+V4+X4+Z4+AB4+AD4","v":0},{"$f":"U4+W4+Y4+AA4+AC4+AE4","v":0},{"$f":"IF(AF4+AG4 < 1,0,AF4*100/(AF4+AG4))","v":{"v":0,"d":"0.00"}}]
["b","Vojtěch Procházka",6,{"$nulls":4},1,4,{"$nulls":6},1,4,{"$f":"P5+Q5","v":5},{"$f":"IF(A5=\"B\",\"X\",\"\")","v":"X"},5,1,5,1,6,11,{"$nulls":6},{"$f":"T5+V5+X5+Z5+AB5+AD5","v":16},13,{"$f":"IF(AF5+AG5 < 1,0,AF5*100/(AF5+AG5))","v":{"v":55.172413793103445,"d":"55.17"}}]
[null,"Matyáš Dolenský",7,3,3,5,4,4,{"$nulls":7},12,7,19,"",{"$nulls":12},0,0,{"v":0,"d":"0.00"}]
[null,"Kryštof Abel",3,5,5,1,9,{"$nulls":8},6,14,20,"",{"$nulls":12},0,0,{"v":0,"d":"0.00"},2]
[null,"Emil Hejda",4,10,2,5,{"$nulls":9},15,2,17,"",{"$nulls":12},0,0,{"v":0,"d":"0.00"}]
{"$rows_left_out":26}
{"sheet":"DEM","index":9,"n_rows":33,"n_cols":35,"rows_kept":33}
["název","Démoni","Bodovani","Z1",null,"Z2",null,"Z3",null,"Z4",null,"Z5",null,"Z6",null,"CEL",null,null,"Brankaři","Z1",null,"Z2",null,"Z3",null,"Z4",null,"Z5",null,"Z6",null,"CEL",null,null,"Tresty"]
["kód","DEM",null,"G","N","G","N","G","N","G","N","G","N","G","N","G","N","K",null,"Z","G","Z","G","Z","G","Z","G","Z","G","Z","G","Z","G","%","min celk."]
["info","Hráči","#"]
["B","Hofmanová Lenka",6,{"$nulls":12},{"$f":"D4+F4+H4+J4+L4+N4","v":0},{"$f":"E4+G4+I4+K4+M4+O4","v":0},{"$f":"P4+Q4","v":0},{"$nulls":13},{"$f":"T4+V4+X4+Z4+AB4+AD4","v":0},{"$f":"U4+W4+Y4+AA4+AC4+AE4","v":0},{"$f":"IF(AF4+AG4 < 1,0,AF4*100/(AF4+AG4))","v":{"v":0,"d":"0.00"}}]
[null,"Fulín David *",30,{"$nulls":12},{"$f":"D5+F5+H5+J5+L5+N5","v":0},{"$f":"E5+G5+I5+K5+M5+O5","v":0},{"$f":"P5+Q5","v":0},{"$f":"IF(A5=\"B\",\"X\",\"\")","v":""},{"$nulls":4},10,12,{"$nulls":6},{"$f":"T5+V5+X5+Z5+AB5+AD5","v":10},12,{"$f":"IF(AF5+AG5 < 1,0,AF5*100/(AF5+AG5))","v":{"v":45.45454545454545,"d":"45.45"}},2]
[null,"Krejčovská Michaela *",7,{"$nulls":12},0,0,0,"",{"$nulls":12},0,0,{"v":0,"d":"0.00"}]
[null,"Adámek Albert *",31,1,null,1,{"$nulls":9},2,0,2,"",{"$nulls":12},0,0,{"v":0,"d":"0.00"},4]
[null,"Sejková Berenika *",10,{"$nulls":12},0,0,0,"x",12,25,{"$nulls":10},12,25,{"v":32.432432432432435,"d":"32.43"}]
{"$rows_left_out":26}
{"sheet":"T5","index":10,"n_rows":33,"n_cols":35,"rows_kept":33,"hidden":true}
["název","T5","Bodovani","Z1",null,"Z2",null,"Z3",null,"Z4",null,"Z5",null,"Z6",null,"CEL",null,null,"Brankaři","Z1",null,"Z2",null,"Z3",null,"Z4",null,"Z5",null,"Z6",null,"CEL",null,null,"Tresty"]
["kód","T5",null,"G","N","G","N","G","N","G","N","G","N","G","N","G","N","K",null,"Z","G","Z","G","Z","G","Z","G","Z","G","Z","G","Z","G","%","min celk."]
["info","Hráči","#"]
[{"$nulls":15},{"$f":"D4+F4+H4+J4+L4+N4","v":0},{"$f":"E4+G4+I4+K4+M4+O4","v":0},{"$f":"P4+Q4","v":0},{"$f":"IF(A4=\"B\",\"X\",\"\")","v":""},{"$nulls":12},{"$f":"T4+V4+X4+Z4+AB4+AD4","v":0},{"$f":"U4+W4+Y4+AA4+AC4+AE4","v":0},{"$f":"IF(AF4+AG4 < 1,0,AF4*100/(AF4+AG4))","v":{"v":0,"d":"0.00"}}]
[{"$nulls":15},{"$f":"D5+F5+H5+J5+L5+N5","v":0},{"$f":"E5+G5+I5+K5+M5+O5","v":0},{"$f":"P5+Q5","v":0},{"$f":"IF(A5=\"B\",\"X\",\"\")","v":""},{"$nulls":12},{"$f":"T5+V5+X5+Z5+AB5+AD5","v":0},0,{"$f":"IF(AF5+AG5 < 1,0,AF5*100/(AF5+AG5))","v":{"v":0,"d":"0.00"}}]
[{"$nulls":15},0,0,0,"",{"$nulls":12},0,0,{"v":0,"d":"0.00"}]
[{"$nulls":15},0,0,0,"",{"$nulls":12},0,0,{"v":0,"d":"0.00"}]
[{"$nulls":15},0,0,0,"",{"$nulls":12},0,0,{"v":0,"d":"0.00"}]
{"$rows_left_out":26}
{"sheet":"T6","index":11,"n_rows":33,"n_cols":35,"rows_kept":33,"hidden":true}
["název",null,"Bodovani","Z1",null,"Z2",null,"Z3",null,"Z4",null,"Z5",null,"Z6",null,"CEL",null,null,"Brankaři","Z1",null,"Z2",null,"Z3",null,"Z4",null,"Z5",null,"Z6",null,"CEL",null,null,"Tresty"]
["kód",null,null,"G","N","G","N","G","N","G","N","G","N","G","N","G","N","K",null,"Z","G","Z","G","Z","G","Z","G","Z","G","Z","G","Z","G","%","min celk."]
["info","Hráči","#"]
[{"$nulls":15},{"$f":"D4+F4+H4+J4+L4+N4","v":0},{"$f":"E4+G4+I4+K4+M4+O4","v":0},{"$f":"P4+Q4","v":0},{"$f":"IF(A4=\"B\",\"X\",\"\")","v":""},{"$nulls":12},{"$f":"T4+V4+X4+Z4+AB4+AD4","v":0},{"$f":"U4+W4+Y4+AA4+AC4+AE4","v":0},{"$f":"IF(AF4+AG4 < 1,0,AF4*100/(AF4+AG4))","v":{"v":0,"d":"0.00"}}]
[{"$nulls":15},{"$f":"D5+F5+H5+J5+L5+N5","v":0},0,{"$f":"P5+Q5","v":0},{"$f":"IF(A5=\"B\",\"X\",\"\")","v":""},{"$nulls":12},{"$f":"T5+V5+X5+Z5+AB5+AD5","v":0},0,{"$f":"IF(AF5+AG5 < 1,0,AF5*100/(AF5+AG5))","v":{"v":0,"d":"0.00"}}]
[{"$nulls":15},0,0,0,"",{"$nulls":12},0,0,{"v":0,"d":"0.00"}]
[{"$nulls":15},0,0,0,"",{"$nulls":12},0,0,{"v":0,"d":"0.00"}]
[{"$nulls":15},0,0,0,"",{"$nulls":12},0,0,{"v":0,"d":"0.00"}]
{"$rows_left_out":26}
{"sheet":"T7","index":12,"n_rows":33,"n_cols":35,"rows_kept":33,"hidden":true}
["název",null,"Bodovani","Z1",null,"Z2",null,"Z3",null,"Z4",null,"Z5",null,"Z6",null,"CEL",null,null,"Brankaři","Z1",null,"Z2",null,"Z3",null,"Z4",null,"Z5",null,"Z6",null,"CEL",null,null,"Tresty"]
["kód",null,null,"G","N","G","N","G","N","G","N","G","N","G","N","G","N","K",null,"Z","G","Z","G","Z","G","Z","G","Z","G","Z","G","Z","G","%","min celk."]
["info","Hráči","#"]
[{"$nulls":15},{"$f":"D4+F4+H4+J4+L4+N4","v":0},{"$f":"E4+G4+I4+K4+M4+O4","v":0},{"$f":"P4+Q4","v":0},{"$f":"IF(A4=\"B\",\"X\",\"\")","v":""},{"$nulls":12},{"$f":"T4+V4+X4+Z4+AB4+AD4","v":0},{"$f":"U4+W4+Y4+AA4+AC4+AE4","v":0},{"$f":"IF(AF4+AG4 < 1,0,AF4*100/(AF4+AG4))","v":{"v":0,"d":"0.00"}}]
[{"$nulls":15},{"$f":"D5+F5+H5+J5+L5+N5","v":0},0,{"$f":"P5+Q5","v":0},{"$f":"IF(A5=\"B\",\"X\",\"\")","v":""},{"$nulls":12},{"$f":"T5+V5+X5+Z5+AB5+AD5","v":0},0,{"$f":"IF(AF5+AG5 < 1,0,AF5*100/(AF5+AG5))","v":{"v":0,"d":"0.00"}}]
[{"$nulls":15},0,0,0,"",{"$nulls":12},0,0,{"v":0,"d":"0.00"}]
[{"$nulls":15},0,0,0,"",{"$nulls":12},0,0,{"v":0,"d":"0.00"}]
[{"$nulls":15},0,0,0,"",{"$nulls":12},0,0,{"v":0,"d":"0.00"}]
{"$rows_left_out":26}
{"sheet":"T8","index":13,"n_rows":33,"n_cols":35,"rows_kept":33,"hidden":true}
["název",null,"Bodovani","Z1",null,"Z2",null,"Z3",null,"Z4",null,"Z5",null,"Z6",null,"CEL",null,null,"Brankaři","Z1",null,"Z2",null,"Z3",null,"Z4",null,"Z5",null,"Z6",null,"CEL",null,null,"Tresty"]
["kód",null,null,"G","N","G","N","G","N","G","N","G","N","G","N","G","N","K",null,"Z","G","Z","G","Z","G","Z","G","Z","G","Z","G","Z","G","%","min celk."]
["info","Hráči","#"]
[{"$nulls":15},{"$f":"D4+F4+H4+J4+L4+N4","v":0},{"$f":"E4+G4+I4+K4+M4+O4","v":0},{"$f":"P4+Q4","v":0},{"$f":"IF(A4=\"B\",\"X\",\"\")","v":""},{"$nulls":12},{"$f":"T4+V4+X4+Z4+AB4+AD4","v":0},{"$f":"U4+W4+Y4+AA4+AC4+AE4","v":0},{"$f":"IF(AF4+AG4 < 1,0,AF4*100/(AF4+AG4))","v":{"v":0,"d":"0.00"}}]
[{"$nulls":15},{"$f":"D5+F5+H5+J5+L5+N5","v":0},0,{"$f":"P5+Q5","v":0},{"$f":"IF(A5=\"B\",\"X\",\"\")","v":""},{"$nulls":12},{"$f":"T5+V5+X5+Z5+AB5+AD5","v":0},0,{"$f":"IF(AF5+AG5 < 1,0,AF5*100/(AF5+AG5))","v":{"v":0,"d":"0.00"}}]
[{"$nulls":15},0,0,0,"",{"$nulls":12},0,0,{"v":0,"d":"0.00"}]
[{"$nulls":15},0,0,0,"",{"$nulls":12},0,0,{"v":0,"d":"0.00"}]
[{"$nulls":15},0,0,0,"",{"$nulls":12},0,0,{"v":0,"d":"0.00"}]
{"$rows_left_out":26}
{"sheet":"CELKEM","index":14,"n_rows":67,"n_cols":13,"rows_kept":67,"hidden":true}
[null,null,"G1","N1","G2","N2","G3","N3","G4","N4","G","N","K"]
["Čech Roman","HIG",19,9,29,8,31,10,{"$f":"INDIRECT(CONCATENATE(\"Statistiky!C\",  MATCH(A2,Statistiky!$A$2:$A$71,0)+1))","v":{"$error":"#N/A"}},{"$f":"INDIRECT(CONCATENATE(\"Statistiky!D\",  MATCH(A2,Statistiky!$A$2:$A$71,0)+1))","v":{"$error":"#N/A"}},{"$f":"C2+E2+G2+I2","v":{"$error":"#N/A"}},{"$f":"D2+F2+H2+J2","v":{"$error":"#N/A"}},{"$f":"K2+L2","v":{"$error":"#N/A"}}]
["Katzer Tomáš","HIG",13,2,18,9,14,4,{"$f":"INDIRECT(CONCATENATE(\"Statistiky!C\",  MATCH(A3,Statistiky!$A$2:$A$71,0)+1))","v":{"$error":"#N/A"}},{"$f":"INDIRECT(CONCATENATE(\"Statistiky!D\",  MATCH(A3,Statistiky!$A$2:$A$71,0)+1))","v":{"$error":"#N/A"}},{"$f":"C3+E3+G3+I3","v":{"$error":"#N/A"}},{"$error":"#N/A"},{"$f":"K3+L3","v":{"$error":"#N/A"}}]
["Vladimír Vrabko","ORL",12,4,17,4,14,6,{"$f":"INDIRECT(CONCATENATE(\"Statistiky!C\",  MATCH(A4,Statistiky!$A$2:$A$71,0)+1))","v":{"$error":"#N/A"}},{"$f":"INDIRECT(CONCATENATE(\"Statistiky!D\",  MATCH(A4,Statistiky!$A$2:$A$71,0)+1))","v":{"$error":"#N/A"}},{"$error":"#N/A"},{"$error":"#N/A"},{"$error":"#N/A"}]
["Petr Němčík ","DZO",12,8,15,9,14,9,{"$f":"INDIRECT(CONCATENATE(\"Statistiky!C\",  MATCH(A5,Statistiky!$A$2:$A$71,0)+1))","v":{"$error":"#N/A"}},{"$f":"INDIRECT(CONCATENATE(\"Statistiky!D\",  MATCH(A5,Statistiky!$A$2:$A$71,0)+1))","v":{"$error":"#N/A"}},{"$error":"#N/A"},{"$error":"#N/A"},{"$error":"#N/A"}]
["Pavel Mikuš","ORL",12,6,4,2,8,12,{"$f":"INDIRECT(CONCATENATE(\"Statistiky!C\",  MATCH(A6,Statistiky!$A$2:$A$71,0)+1))","v":{"$error":"#N/A"}},{"$f":"INDIRECT(CONCATENATE(\"Statistiky!D\",  MATCH(A6,Statistiky!$A$2:$A$71,0)+1))","v":{"$error":"#N/A"}},{"$error":"#N/A"},{"$error":"#N/A"},{"$error":"#N/A"}]
["Diblík Jan","HIG",4,9,3,9,6,13,{"$f":"INDIRECT(CONCATENATE(\"Statistiky!C\",  MATCH(A7,Statistiky!$A$2:$A$71,0)+1))","v":{"$error":"#N/A"}},{"$f":"INDIRECT(CONCATENATE(\"Statistiky!D\",  MATCH(A7,Statistiky!$A$2:$A$71,0)+1))","v":{"$error":"#N/A"}},{"$error":"#N/A"},{"$error":"#N/A"},{"$error":"#N/A"}]
["Adam Štefanka","ORL",12,3,0,0,16,6,{"$f":"INDIRECT(CONCATENATE(\"Statistiky!C\",  MATCH(A8,Statistiky!$A$2:$A$71,0)+1))","v":{"$error":"#N/A"}},{"$f":"INDIRECT(CONCATENATE(\"Statistiky!D\",  MATCH(A8,Statistiky!$A$2:$A$71,0)+1))","v":{"$error":"#N/A"}},{"$error":"#N/A"},{"$error":"#N/A"},{"$error":"#N/A"}]
{"$rows_left_out":59}